﻿"Item Id","Item URI","Dublin Core:Title","Dublin Core:Identifier","Dublin Core:Is Referenced By","Dublin Core:Alternative Title","Dublin Core:Creator","Dublin Core:Date","Dublin Core:Description","Dublin Core:Subject","Dublin Core:Spatial Coverage","Dublin Core:Extent","Dublin Core:Medium","Dublin Core:Format","Dublin Core:Rights","Dublin Core:Language","Dublin Core:Type","Dublin Core:Has Format","Dublin Core:Has Version","Dublin Core:Source","Dublin Core:Publisher","Dublin Core:Contributor","Dublin Core:Relation","Dublin Core:Coverage","Dublin Core:Abstract","Dublin Core:Table Of Contents","Dublin Core:Date Available","Dublin Core:Date Created","Dublin Core:Date Accepted","Dublin Core:Date Copyrighted","Dublin Core:Date Submitted","Dublin Core:Date Issued","Dublin Core:Date Modified","Dublin Core:Date Valid","Dublin Core:Access Rights","Dublin Core:License","Dublin Core:Conforms To","Dublin Core:Has Part","Dublin Core:Is Format Of","Dublin Core:Is Part Of","Dublin Core:Is Replaced By","Dublin Core:Is Required By","Dublin Core:Is Version Of","Dublin Core:References","Dublin Core:Replaces","Dublin Core:Requires","Dublin Core:Bibliographic Citation","Dublin Core:Temporal Coverage","Dublin Core:Accrual Method","Dublin Core:Accrual Periodicity","Dublin Core:Accrual Policy","Dublin Core:Audience","Dublin Core:Audience Education Level","Dublin Core:Mediator","Dublin Core:Instructional Method","Dublin Core:Provenance","Dublin Core:Rights Holder","Item Type Metadata:Text","Item Type Metadata:Interviewer","Item Type Metadata:Interviewee","Item Type Metadata:Location","Item Type Metadata:Transcription","Item Type Metadata:Local URL","Item Type Metadata:Original Format","Item Type Metadata:Physical Dimensions","Item Type Metadata:Duration","Item Type Metadata:Compression","Item Type Metadata:Producer","Item Type Metadata:Director","Item Type Metadata:Bit Rate/Frequency","Item Type Metadata:Time Summary","Item Type Metadata:Email Body","Item Type Metadata:Subject Line","Item Type Metadata:From","Item Type Metadata:To","Item Type Metadata:CC","Item Type Metadata:BCC","Item Type Metadata:Number of Attachments","Item Type Metadata:Standards","Item Type Metadata:Objectives","Item Type Metadata:Materials","Item Type Metadata:Lesson Plan Text","Item Type Metadata:URL","Item Type Metadata:Event Type","Item Type Metadata:Participants","Item Type Metadata:Birth Date","Item Type Metadata:Birthplace","Item Type Metadata:Death Date","Item Type Metadata:Occupation","Item Type Metadata:Biographical Text","Item Type Metadata:Bibliography","Item Type Metadata:Legacy Record Number","Item Type Metadata:Series Code","Item Type Metadata:File Number","Item Type Metadata:Shelf Location","Item Type Metadata:Microfilm","Item Type Metadata:Series","Item Type Metadata:1827 Catalog","Item Type Metadata:1840 Catalog","Item Type Metadata:1857 Catalog","Item Type Metadata:1857 Inventory","Item Type Metadata:1894 Catalog","Item Type Metadata:1894 Inventory","Item Type Metadata:Accession Number","Item Type Metadata:Binding Condition","Item Type Metadata:Binding","Item Type Metadata:Condition","Item Type Metadata:Conservation Assessment","Item Type Metadata:Conservation Comment","Item Type Metadata:Conservation Source","Item Type Metadata:Conservation","Item Type Metadata:Copy","Item Type Metadata:Cover","Item Type Metadata:Enclosure Condition","Item Type Metadata:Enclosure Type","Item Type Metadata:Housing","Item Type Metadata:Inclusions","Item Type Metadata:Inscriptions","Item Type Metadata:Publisher Location","Item Type Metadata:Paper","Item Type Metadata:Post 1894 Catalog / Inventory","Item Type Metadata:Treatment","Item Type Metadata:Value","Item Type Metadata:Volume","Item Type Metadata:Cataloged By","Item Type Metadata:History","Item Type Metadata:Markings","Item Type Metadata:Negative Number","Item Type Metadata:Measurements","Item Type Metadata:Photo Roll Number","Item Type Metadata:Present Location","Item Type Metadata:Reference","Item Type Metadata:See Also","Item Type Metadata:Where Made","Item Type Metadata:Date Cataloged","Item Type Metadata:AIA Photo Number","Item Type Metadata:Inventory","Item Type Metadata:Slide Number","Item Type Metadata:Additional Data","Item Type Metadata:Affiliated Members of Company","Item Type Metadata:Application Date","Item Type Metadata:Office Held","Item Type Metadata:Committee Membership","Item Type Metadata:Brochures, etc.","Item Type Metadata:Business Name","Item Type Metadata:Children","Item Type Metadata:Where Born","Item Type Metadata:Civic Activities","Item Type Metadata:Deceased Date","Item Type Metadata:Descendant","Item Type Metadata:Education","Item Type Metadata:Date Elected","Item Type Metadata:Date Expelled","Item Type Metadata:Father","Item Type Metadata:First Name","Item Type Metadata:Last Name","Item Type Metadata:Listings","Item Type Metadata:Married","Item Type Metadata:Member Number","Item Type Metadata:Middle Name","Item Type Metadata:Military","Item Type Metadata:Mother","Item Type Metadata:Nominator","Item Type Metadata:Nonprofit Directorships","Item Type Metadata:Notes","Item Type Metadata:Other Affiliations","Item Type Metadata:Personal Background","Item Type Metadata:Professional Activities","Item Type Metadata:Project","Item Type Metadata:Date Resigned","Item Type Metadata:Revolutionary War","Item Type Metadata:Seconder","Item Type Metadata:Spouse Born","Item Type Metadata:Spouse Name","Item Type Metadata:Name Suffix","Item Type Metadata:Clubs","Item Type Metadata:Senior Status","Item Type Metadata:Video Interview","Item Type Metadata:Grantor Records Notes","Item Type Metadata:Deed Granted to","Item Type Metadata:Defendant/Sheriff's Sale Notes","Item Type Metadata:Defendant/Sheriff's Sale to","Item Type Metadata:Descendant Address","Item Type Metadata:Business Address","Item Type Metadata:Home Address","Item Type Metadata:Telephone","Item Type Metadata:Member in 1775","Item Type Metadata:No Signature","Item Type Metadata:APS Item Number","Item Type Metadata:Box","Item Type Metadata:Item Location","Item Type Metadata:Transcription Source",tags,file,itemType,collection,public,featured
13221,https://archive.carpentershall.org/items/show/13221,"250th Anniversary & Long-term Hall Restoration Funding",,,,,1973-12-04,,"Financial Issues Correspondence",,,,,,,,,,"Thomas S. Keefer 100/14",,,,,,,,,,,,,,,,,,,,,,,,,,,,,,,,,,,,,,,,,,,,,,,,,,,,,,,,,,,,,,,,,,,,,,,,1871,6Q,28,"Box #122",,"Financial Records",,,,,,,,,,,,,,,,,,,,,,,,,,,,,,,,,,,,,,,,,,,,,,,,,,,,,,,,,,,,,,,,,,,,,,,,,,,,,,,,,,,,,,,,,,,,,,,,"""Finances,250th Anniversary"",Restoration",,Archival,,1,0
13704,https://archive.carpentershall.org/items/show/13704,"Accounting balance sheets for Trustees Report for 1936",,,,,c.,,"Accounts & Investments (Trustees)",,,,,,,,,,,,,,,,,,,,,,,,,,,,,,,,,,,,,,,,,,,,,,,,,,,,,,,,,,,,,,,,,,,,,,,,,,,,,,,,,,2354,6L,,"Box #79",,"Financial Records",,,,,,,,,,,,,,,,,,,,,,,,,,,,,,,,,,,,,,,,,,,,,,,,,,,,,,,,,,,,,,,,,,,,,,,,,,,,,,,,,,,,,,,,,,,,,,,,"""Finances,Book keeping""",,Archival,,1,0
13414,https://archive.carpentershall.org/items/show/13414,"Apprentice Training Award Certificate",,,,,1954-01-01,,"Apprentice Programs",,,,,,,,,,"Thomas S. Keefer 100/14",,,,,,,,,,,,,,,,,,,,,,,,,,,,,,,,,,,,,,,,,,,,,,,,,,,,,,,,,,,,,,,,,,,,,,,,2064,8H,30,"Box #129",,"Carpenters' Company Miscellany",,,,,,,,,,,,,,,,,,,,,,,,,,,,,,,,,,,,,,,,,,,,,,,,,,,,,,,,,,,,,,,,,,,,,,,,,,,,,,,,,,,,,,,,,,,,,,,,"""Finances,Bills and receipts,Bookkeeping",,Archival,,1,0
13644,https://archive.carpentershall.org/items/show/13644,"Auditor's Committee Report",,,,,,,Committees,,,,,,,,,,,,,,,,,,,,,,,,,,,,,,,,,,,,,,,,,,,,,,,,,,,,,,,,,,,,,,,,,,,,,,,,,,,,,,,,,,2294,3H,,"Box #77",,"Membership Records & Rules",,,,,,,,,,,,,,,,,,,,,,,,,,,,,,,,,,,,,,,,,,,,,,,,,,,,,,,,,,,,,,,,,,,,,,,,,,,,,,,,,,,,,,,,,,,,,,,,"""Finances,Auditor's Report",,Archival,,1,0
13658,https://archive.carpentershall.org/items/show/13658,"Auditor's Report",,,,,,,"Auditors' Reports",,,,,,,,,,,,,,,,,,,,,,,,,,,,,,,,,,,,,,,,,,,,,,,,,,,,,,,,,,,,,,,,,,,,,,,,,,,,,,,,,,2308,6O,,"Box #77",,"Financial Records",,,,,,,,,,,,,,,,,,,,,,,,,,,,,,,,,,,,,,,,,,,,,,,,,,,,,,,,,,,,,,,,,,,,,,,,,,,,,,,,,,,,,,,,,,,,,,,,"""Finances,Auditor's Report",,Archival,,1,0
13721,https://archive.carpentershall.org/items/show/13721,"Auditor's Report (2 copies)",,,,,,,"Auditors' Reports",,,,,,,,,,,,,,,,,,,,,,,,,,,,,,,,,,,,,,,,,,,,,,,,,,,,,,,,,,,,,,,,,,,,,,,,,,,,,,,,,,2371,6O,,"Box #79",,"Financial Records",,,,,,,,,,,,,,,,,,,,,,,,,,,,,,,,,,,,,,,,,,,,,,,,,,,,,,,,,,,,,,,,,,,,,,,,,,,,,,,,,,,,,,,,,,,,,,,,"""Finances,Auditor's Report",,Archival,,1,0
13705,https://archive.carpentershall.org/items/show/13705,"Auditor's report for year ending 1938 (4 copies)",,,,,,,"Accounts & Investments (Trustees)",,,,,,,,,,,,,,,,,,,,,,,,,,,,,,,,,,,,,,,,,,,,,,,,,,,,,,,,,,,,,,,,,,,,,,,,,,,,,,,,,,2355,6L,,"Box #79",,"Financial Records",,,,,,,,,,,,,,,,,,,,,,,,,,,,,,,,,,,,,,,,,,,,,,,,,,,,,,,,,,,,,,,,,,,,,,,,,,,,,,,,,,,,,,,,,,,,,,,,"""Finances,Auditor's Report",,Archival,,1,0
15542,https://archive.carpentershall.org/items/show/15542,"Auditor's Reports, Financial Statements, and Supporting Documents",,,,,1988-03-31,,"Auditor's Reports [And Form 990]",,,,,,,,,,"William Hough",,,,,,,,,,,,,,,,,,,,,,,,,,,,,,,,,,,,,,,,,,,,,,,,,,,,,,,,,,,,,,,,,,,,,,,,3494,6O,36,"Box #160",,"Financial Records",,,,,,,,,,,,,,,,,,,,,,,,,,,,,,,,,,,,,,,,,,,,,,,,,,,,,,,,,,,,,,,,,,,,,,,,,,,,,,,,,,,,,,,,,,,,,,,,"""Finances,Reports""",,Archival,,1,0
13416,https://archive.carpentershall.org/items/show/13416,"Bank Statements (Tradesmens National Bank & Trust Co.)",,,,,1946-01-01,,"Accounts & Investments (Trustees)",,,,,,,,,,,,,,,,,,,,,,,,,,,,,,,,,,,,,,,,,,,,,,,,,,,,,,,,,,,,,,,,,,,,,,,,,,,,,,,,,,2066,6L,1,"Box #130",,"Financial Records",,,,,,,,,,,,,,,,,,,,,,,,,,,,,,,,,,,,,,,,,,,,,,,,,,,,,,,,,,,,,,,,,,,,,,,,,,,,,,,,,,,,,,,,,,,,,,,,"""Finances,Bills and receipts,Bookkeeping",,Archival,,1,0
13417,https://archive.carpentershall.org/items/show/13417,"Bank Statements (Tradesmens National Bank & Trust Co.)",,,,,1950-01-01,,"Accounts & Investments (Trustees)",,,,,,,,,,,,,,,,,,,,,,,,,,,,,,,,,,,,,,,,,,,,,,,,,,,,,,,,,,,,,,,,,,,,,,,,,,,,,,,,,,2067,6L,2,"Box #130",,"Financial Records",,,,,,,,,,,,,,,,,,,,,,,,,,,,,,,,,,,,,,,,,,,,,,,,,,,,,,,,,,,,,,,,,,,,,,,,,,,,,,,,,,,,,,,,,,,,,,,,"""Finances,Bills and receipts,Bookkeeping",,Archival,,1,0
13418,https://archive.carpentershall.org/items/show/13418,"Bank Statements (Tradesmens National Bank & Trust Co.)",,,,,1954-01-01,,"Accounts & Investments (Trustees)",,,,,,,,,,,,,,,,,,,,,,,,,,,,,,,,,,,,,,,,,,,,,,,,,,,,,,,,,,,,,,,,,,,,,,,,,,,,,,,,,,2068,6L,3,"Box #130",,"Financial Records",,,,,,,,,,,,,,,,,,,,,,,,,,,,,,,,,,,,,,,,,,,,,,,,,,,,,,,,,,,,,,,,,,,,,,,,,,,,,,,,,,,,,,,,,,,,,,,,"""Finances,Bills and receipts,Bookkeeping",,Archival,,1,0
13131,https://archive.carpentershall.org/items/show/13131,"Budget & Income (Estimated ) for 1967",,,,,,,"Accounting Papers",,,,,,,,,,,,,,,,,,,,,,,,,,,,,,,,,,,,,,,,,,,,,,,,,,,,,,,,,,,,,,,,,,,,,,,,,,,,,,,,,,1781,6C,67,"Box #120",,"FInancial Records",,,,,,,,,,,,,,,,,,,,,,,,,,,,,,,,,,,,,,,,,,,,,,,,,,,,,,,,,,,,,,,,,,,,,,,,,,,,,,,,,,,,,,,,,,,,,,,,"""Finances,250th Anniversary""",,Archival,,1,0
13195,https://archive.carpentershall.org/items/show/13195,"Cancelled Checks",,,,,,,"Misc. Financial Papers",,,,,,,,,,,,,,,,,,,,,,,,,,,,,,,,,,,,,,,,,,,,,,,,,,,,,,,,,,,,,,,,,,,,,,,,,,,,,,,,,,1845,6P,2,"Box #122",,"Financial Records",,,,,,,,,,,,,,,,,,,,,,,,,,,,,,,,,,,,,,,,,,,,,,,,,,,,,,,,,,,,,,,,,,,,,,,,,,,,,,,,,,,,,,,,,,,,,,,,"""Finances,Bookkeeping""",,Archival,,1,0
13537,https://archive.carpentershall.org/items/show/13537,"Cancelled Checks (Fidelity Philadelphia Trust Co.)",,,,,1955-12-31,,"Misc. Financial Papers",,,,,,,,,,,,,,,,,,,,,,,,,,,,,,,,,,,,,,,,,,,,,,,,,,,,,,,,,,,,,,,,,,,,,,,,,,,,,,,,,,2187,6P,15,"Box #134",,"Financial Records",,,,,,,,,,,,,,,,,,,,,,,,,,,,,,,,,,,,,,,,,,,,,,,,,,,,,,,,,,,,,,,,,,,,,,,,,,,,,,,,,,,,,,,,,,,,,,,,"""Finances,Bills and receipts,Bookkeeping",,Archival,,1,0
13539,https://archive.carpentershall.org/items/show/13539,"Cancelled Checks (Fidelity Philadelphia Trust Co.)",,,,,1956-12-31,,"Misc. Financial Papers",,,,,,,,,,,,,,,,,,,,,,,,,,,,,,,,,,,,,,,,,,,,,,,,,,,,,,,,,,,,,,,,,,,,,,,,,,,,,,,,,,2189,6P,17,"Box #134",,"Financial Records",,,,,,,,,,,,,,,,,,,,,,,,,,,,,,,,,,,,,,,,,,,,,,,,,,,,,,,,,,,,,,,,,,,,,,,,,,,,,,,,,,,,,,,,,,,,,,,,"""Finances,Bills and receipts,Bookkeeping",,Archival,,1,0
13532,https://archive.carpentershall.org/items/show/13532,"Cancelled Checks (Tradesmens National Bank & Trust Co. / The Pennsylvania Company / Fidelity Philadelphia Trust Co.))",,,,,1952-12-31,,"Misc. Financial Papers",,,,,,,,,,,,,,,,,,,,,,,,,,,,,,,,,,,,,,,,,,,,,,,,,,,,,,,,,,,,,,,,,,,,,,,,,,,,,,,,,,2182,6P,10,"Box #134",,"Financial Records",,,,,,,,,,,,,,,,,,,,,,,,,,,,,,,,,,,,,,,,,,,,,,,,,,,,,,,,,,,,,,,,,,,,,,,,,,,,,,,,,,,,,,,,,,,,,,,,"""Finances,Bills and receipts,Bookkeeping",,Archival,,1,0
13523,https://archive.carpentershall.org/items/show/13523,"Cancelled Checks (Tradesmens National Bank & Trust Co.)",,,,,1940-12-31,,"Misc. Financial Papers",,,,,,,,,,,,,,,,,,,,,,,,,,,,,,,,,,,,,,,,,,,,,,,,,,,,,,,,,,,,,,,,,,,,,,,,,,,,,,,,,,2173,6P,1,"Box #134, APS 2010",,"Financial Records",,,,,,,,,,,,,,,,,,,,,,,,,,,,,,,,,,,,,,,,,,,,,,,,,,,,,,,,,,,,,,,,,,,,,,,,,,,,,,,,,,,,,,,,,,,,,,,,"""Finances,Bills and receipts,Bookkeeping",,Archival,,1,0
13524,https://archive.carpentershall.org/items/show/13524,"Cancelled Checks (Tradesmens National Bank & Trust Co.)",,,,,1943-12-31,,"Misc. Financial Papers",,,,,,,,,,,,,,,,,,,,,,,,,,,,,,,,,,,,,,,,,,,,,,,,,,,,,,,,,,,,,,,,,,,,,,,,,,,,,,,,,,2174,6P,2,"Box #134",,"Financial Records",,,,,,,,,,,,,,,,,,,,,,,,,,,,,,,,,,,,,,,,,,,,,,,,,,,,,,,,,,,,,,,,,,,,,,,,,,,,,,,,,,,,,,,,,,,,,,,,"""Finances,Bills and receipts,Bookkeeping",,Archival,,1,0
13525,https://archive.carpentershall.org/items/show/13525,"Cancelled Checks (Tradesmens National Bank & Trust Co.)",,,,,1945-12-31,,"Misc. Financial Papers",,,,,,,,,,,,,,,,,,,,,,,,,,,,,,,,,,,,,,,,,,,,,,,,,,,,,,,,,,,,,,,,,,,,,,,,,,,,,,,,,,2175,6P,3,"Box #134",,"Financial Records",,,,,,,,,,,,,,,,,,,,,,,,,,,,,,,,,,,,,,,,,,,,,,,,,,,,,,,,,,,,,,,,,,,,,,,,,,,,,,,,,,,,,,,,,,,,,,,,"""Finances,Bills and receipts,Bookkeeping",,Archival,,1,0
13526,https://archive.carpentershall.org/items/show/13526,"Cancelled Checks (Tradesmens National Bank & Trust Co.)",,,,,1946-12-31,,"Misc. Financial Papers",,,,,,,,,,,,,,,,,,,,,,,,,,,,,,,,,,,,,,,,,,,,,,,,,,,,,,,,,,,,,,,,,,,,,,,,,,,,,,,,,,2176,6P,4,"Box #134",,"Financial Records",,,,,,,,,,,,,,,,,,,,,,,,,,,,,,,,,,,,,,,,,,,,,,,,,,,,,,,,,,,,,,,,,,,,,,,,,,,,,,,,,,,,,,,,,,,,,,,,"""Finances,Bills and receipts,Bookkeeping",,Archival,,1,0
13527,https://archive.carpentershall.org/items/show/13527,"Cancelled Checks (Tradesmens National Bank & Trust Co.)",,,,,1947-12-31,,"Misc. Financial Papers",,,,,,,,,,,,,,,,,,,,,,,,,,,,,,,,,,,,,,,,,,,,,,,,,,,,,,,,,,,,,,,,,,,,,,,,,,,,,,,,,,2177,6P,5,"Box #134",,"Financial Records",,,,,,,,,,,,,,,,,,,,,,,,,,,,,,,,,,,,,,,,,,,,,,,,,,,,,,,,,,,,,,,,,,,,,,,,,,,,,,,,,,,,,,,,,,,,,,,,"""Finances,Bills and receipts,Bookkeeping",,Archival,,1,0
13528,https://archive.carpentershall.org/items/show/13528,"Cancelled Checks (Tradesmens National Bank & Trust Co.)",,,,,1948-12-31,,"Misc. Financial Papers",,,,,,,,,,,,,,,,,,,,,,,,,,,,,,,,,,,,,,,,,,,,,,,,,,,,,,,,,,,,,,,,,,,,,,,,,,,,,,,,,,2178,6P,6,"Box #134",,"Financial Records",,,,,,,,,,,,,,,,,,,,,,,,,,,,,,,,,,,,,,,,,,,,,,,,,,,,,,,,,,,,,,,,,,,,,,,,,,,,,,,,,,,,,,,,,,,,,,,,"""Finances,Bills and receipts,Bookkeeping",,Archival,,1,0
13529,https://archive.carpentershall.org/items/show/13529,"Cancelled Checks (Tradesmens National Bank & Trust Co.)",,,,,1949-12-31,,"Misc. Financial Papers",,,,,,,,,,,,,,,,,,,,,,,,,,,,,,,,,,,,,,,,,,,,,,,,,,,,,,,,,,,,,,,,,,,,,,,,,,,,,,,,,,2179,6P,7,"Box #134",,"Financial Records",,,,,,,,,,,,,,,,,,,,,,,,,,,,,,,,,,,,,,,,,,,,,,,,,,,,,,,,,,,,,,,,,,,,,,,,,,,,,,,,,,,,,,,,,,,,,,,,"""Finances,Bills and receipts,Bookkeeping",,Archival,,1,0
13530,https://archive.carpentershall.org/items/show/13530,"Cancelled Checks (Tradesmens National Bank & Trust Co.)",,,,,1950-12-31,,"Misc. Financial Papers",,,,,,,,,,,,,,,,,,,,,,,,,,,,,,,,,,,,,,,,,,,,,,,,,,,,,,,,,,,,,,,,,,,,,,,,,,,,,,,,,,2180,6P,8,"Box #134",,"Financial Records",,,,,,,,,,,,,,,,,,,,,,,,,,,,,,,,,,,,,,,,,,,,,,,,,,,,,,,,,,,,,,,,,,,,,,,,,,,,,,,,,,,,,,,,,,,,,,,,"""Finances,Bills and receipts,Bookkeeping",,Archival,,1,0
13531,https://archive.carpentershall.org/items/show/13531,"Cancelled Checks (Tradesmens National Bank & Trust Co.)",,,,,1951-12-31,,"Misc. Financial Papers",,,,,,,,,,,,,,,,,,,,,,,,,,,,,,,,,,,,,,,,,,,,,,,,,,,,,,,,,,,,,,,,,,,,,,,,,,,,,,,,,,2181,6P,9,"Box #134",,"Financial Records",,,,,,,,,,,,,,,,,,,,,,,,,,,,,,,,,,,,,,,,,,,,,,,,,,,,,,,,,,,,,,,,,,,,,,,,,,,,,,,,,,,,,,,,,,,,,,,,"""Finances,Bills and receipts,Bookkeeping",,Archival,,1,0
13533,https://archive.carpentershall.org/items/show/13533,"Cancelled Checks (Tradesmens National Bank & Trust Co.)",,,,,1953-12-31,,"Misc. Financial Papers",,,,,,,,,,,,,,,,,,,,,,,,,,,,,,,,,,,,,,,,,,,,,,,,,,,,,,,,,,,,,,,,,,,,,,,,,,,,,,,,,,2183,6P,11,"Box #134",,"Financial Records",,,,,,,,,,,,,,,,,,,,,,,,,,,,,,,,,,,,,,,,,,,,,,,,,,,,,,,,,,,,,,,,,,,,,,,,,,,,,,,,,,,,,,,,,,,,,,,,"""Finances,Bills and receipts,Bookkeeping",,Archival,,1,0
13536,https://archive.carpentershall.org/items/show/13536,"Cancelled Checks (Tradesmens National Bank & Trust Co.)",,,,,1954-12-31,,"Misc. Financial Papers",,,,,,,,,,,,,,,,,,,,,,,,,,,,,,,,,,,,,,,,,,,,,,,,,,,,,,,,,,,,,,,,,,,,,,,,,,,,,,,,,,2186,6P,14,"Box #134",,"Financial Records",,,,,,,,,,,,,,,,,,,,,,,,,,,,,,,,,,,,,,,,,,,,,,,,,,,,,,,,,,,,,,,,,,,,,,,,,,,,,,,,,,,,,,,,,,,,,,,,"""Finances,Bills and receipts,Bookkeeping",,Archival,,1,0
13535,https://archive.carpentershall.org/items/show/13535,"Cancelled Checks & Deposit Slips (Fidelity Philadelphia Trust Co.)",,,,,1954-12-31,,"Misc. Financial Papers",,,,,,,,,,,,,,,,,,,,,,,,,,,,,,,,,,,,,,,,,,,,,,,,,,,,,,,,,,,,,,,,,,,,,,,,,,,,,,,,,,2185,6P,13,"Box #134",,"Financial Records",,,,,,,,,,,,,,,,,,,,,,,,,,,,,,,,,,,,,,,,,,,,,,,,,,,,,,,,,,,,,,,,,,,,,,,,,,,,,,,,,,,,,,,,,,,,,,,,"""Finances,Bills and receipts,Bookkeeping",,Archival,,1,0
13413,https://archive.carpentershall.org/items/show/13413,"Carpenter's Apprenticeship Training Award for Excellence",,,,,1950-01-01,,"Apprentice Programs",,,,,,,,,,"Thomas S. Keefer 99/10",,,,,,,,,,,,,,,,,,,,,,,,,,,,,,,,,,,,,,,,,,,,,,,,,,,,,,,,,,,,,,,,,,,,,,,,2063,8H,29,"Box #129",,"Carpenters' Company Miscellany",,,,,,,,,,,,,,,,,,,,,,,,,,,,,,,,,,,,,,,,,,,,,,,,,,,,,,,,,,,,,,,,,,,,,,,,,,,,,,,,,,,,,,,,,,,,,,,,"""Finances,Bills and receipts,Bookkeeping",,Archival,,1,0
13207,https://archive.carpentershall.org/items/show/13207,"Carpenters' Company Operating Statement.",,,,,1981-05-01,,"Misc. Financial Papers",,,,,,,,,,,,,,,,,,,,,,,,,,,,,,,,,,,,,,,,,,,,,,,,,,,,,,,,,,,,,,,,,,,,,,,,,,,,,,,,,,1857,6P,14,"Box #122",,"Financial Records",,,,,,,,,,,,,,,,,,,,,,,,,,,,,,,,,,,,,,,,,,,,,,,,,,,,,,,,,,,,,,,,,,,,,,,,,,,,,,,,,,,,,,,,,,,,,,,,"""Finances,Bills and receipts,Bookkeeping",,Archival,,1,0
13132,https://archive.carpentershall.org/items/show/13132,"Checks Written for 250th Anniversary",,,,,,,"Accounting Papers",,,,,,,,,,,,,,,,,,,,,,,,,,,,,,,,,,,,,,,,,,,,,,,,,,,,,,,,,,,,,,,,,,,,,,,,,,,,,,,,,,1782,6C,68,"Box #120",,"FInancial Records",,,,,,,,,,,,,,,,,,,,,,,,,,,,,,,,,,,,,,,,,,,,,,,,,,,,,,,,,,,,,,,,,,,,,,,,,,,,,,,,,,,,,,,,,,,,,,,,"""Finances,250th Anniversary""",,Archival,,1,0
13208,https://archive.carpentershall.org/items/show/13208,"Copy of Treasurer Report for August 1981",,,,,1978-04-12,,"Misc. Financial Papers",,,,,,,,,,,,,,,,,,,,,,,,,,,,,,,,,,,,,,,,,,,,,,,,,,,,,,,,,,,,,,,,,,,,,,,,,,,,,,,,,,1858,6P,15,"Box #122",,"Financial Records",,,,,,,,,,,,,,,,,,,,,,,,,,,,,,,,,,,,,,,,,,,,,,,,,,,,,,,,,,,,,,,,,,,,,,,,,,,,,,,,,,,,,,,,,,,,,,,,"""Finances,Auditor's Report,Long Range Planning""",,Archival,,1,0
13519,https://archive.carpentershall.org/items/show/13519,"Corres. re: Honoring Charles Kessler as Treasurer Emeritus",,,,,1985-12-20,,"Members' Vital Statistics",,,,,,,,,,"(CEP for Thomas S. Keefer)",,,,,,,,,,,,,,,,,,,,,,,,,,,,,,,,,,,,,,,,,,,,,,,,,,,,,,,,,,,,,,,,,,,,,,,,2169,3F,37,"Box #133",,"Membership Records & Rules",,,,,,,,,,,,,,,,,,,,,,,,,,,,,,,,,,,,,,,,,,,,,,,,,,,,,,,,,,,,,,,,,,,,,,,,,,,,,,,,,,,,,,,,,,,,,,,,"""Finances,Bills and receipts,Bookkeeping",,Archival,,1,0
13521,https://archive.carpentershall.org/items/show/13521,"Corres. re: Restore Philadelphia (and its director, Gersil Kay) Includes a draft for a program about Preservation entitled ""The British Connection""",,,,,1985-08-01,,"Celebrations / Special Events",,,,,,,,,,"(CEP for Thomas S. Keefer)",,,,,,,,,,,,,,,,,,,,,,,,,,,,,,,,,,,,,,,,,,,,,,,,,,,,,,,,,,,,,,,,,,,,,,,,2171,8C,39,"Box #133",,"Carpenters' Company Miscellany",,,,,,,,,,,,,,,,,,,,,,,,,,,,,,,,,,,,,,,,,,,,,,,,,,,,,,,,,,,,,,,,,,,,,,,,,,,,,,,,,,,,,,,,,,,,,,,,"""Finances,Bills and receipts,Bookkeeping",,Archival,,1,0
13203,https://archive.carpentershall.org/items/show/13203,"Correspondence re: Bank Signature Arrangements",,,,,,,"Misc. Financial Papers",,,,,,,,,,"Thomas S. Keefer 99/4",,,,,,,,,,,,,,,,,,,,,,,,,,,,,,,,,,,,,,,,,,,,,,,,,,,,,,,,,,,,,,,,,,,,,,,,1853,6P,10,"Box #122",,"Financial Records",,,,,,,,,,,,,,,,,,,,,,,,,,,,,,,,,,,,,,,,,,,,,,,,,,,,,,,,,,,,,,,,,,,,,,,,,,,,,,,,,,,,,,,,,,,,,,,,"""Finances,Bookkeeping""",,Archival,,1,0
13214,https://archive.carpentershall.org/items/show/13214,"Correspondence re: Investments",,,,,1952-01-01,,"Financial Issues Correspondence",,,,,,,,,,,,,,,,,,,,,,,,,,,,,,,,,,,,,,,,,,,,,,,,,,,,,,,,,,,,,,,,,,,,,,,,,,,,,,,,,,1864,6Q,21,"Box #122",,"Financial Records",,,,,,,,,,,,,,,,,,,,,,,,,,,,,,,,,,,,,,,,,,,,,,,,,,,,,,,,,,,,,,,,,,,,,,,,,,,,,,,,,,,,,,,,,,,,,,,,"""Finances,assets""",,Archival,,1,0
13140,https://archive.carpentershall.org/items/show/13140,"Correspondence re: Securities",,,,,,,"Accounts & Investments (Trustees)",,,,,,,,,,"Thomas S. Keefer 100/14",,,,,,,,,,,,,,,,,,,,,,,,,,,,,,,,,,,,,,,,,,,,,,,,,,,,,,,,,,,,,,,,,,,,,,,,1790,6L,76,"Box #120",,"Financial Records",,,,,,,,,,,,,,,,,,,,,,,,,,,,,,,,,,,,,,,,,,,,,,,,,,,,,,,,,,,,,,,,,,,,,,,,,,,,,,,,,,,,,,,,,,,,,,,,"""Finances,assets""",,Archival,,1,0
13534,https://archive.carpentershall.org/items/show/13534,"Deposit Receipts (Tradesmens Land Title Bank & Trust Company)",,,,,1954-12-31,,"Misc. Financial Papers",,,,,,,,,,,,,,,,,,,,,,,,,,,,,,,,,,,,,,,,,,,,,,,,,,,,,,,,,,,,,,,,,,,,,,,,,,,,,,,,,,2184,6P,12,"Box #134",,"Financial Records",,,,,,,,,,,,,,,,,,,,,,,,,,,,,,,,,,,,,,,,,,,,,,,,,,,,,,,,,,,,,,,,,,,,,,,,,,,,,,,,,,,,,,,,,,,,,,,,"""Finances,Bills and receipts,Bookkeeping",,Archival,,1,0
13518,https://archive.carpentershall.org/items/show/13518,"Endowment Planning & Fundraising (includes a challenge bequest issued by C. Peterson)",,,,,1986-04-08,,Committees,,,,,,,,,,"(CEP for Thomas S. Keefer)",,,,,,,,,,,,,,,,,,,,,,,,,,,,,,,,,,,,,,,,,,,,,,,,,,,,,,,,,,,,,,,,,,,,,,,,2168,3H,36,"Box #133",,"Membership Records & Rules",,,,,,,,,,,,,,,,,,,,,,,,,,,,,,,,,,,,,,,,,,,,,,,,,,,,,,,,,,,,,,,,,,,,,,,,,,,,,,,,,,,,,,,,,,,,,,,,"""Finances,Endowment,Fundraising & Development,Long Range Planning""",,Archival,,1,0
13608,https://archive.carpentershall.org/items/show/13608,"Extracts from cash book",,,,,1919-01-01,,"Misc. Financial Papers",,,,,,,,,,,,,,,,,,,,,,,,,,,,,,,,,,,,,,,,,,,,,,,,,,,,,,,,,,,,,,,,,,,,,,,,,,,,,,,,,,2258,6P,,"Box #76",,"Financial Records",,,,,,,,,,,,,,,,,,,,,,,,,,,,,,,,,,,,,,,,,,,,,,,,,,,,,,,,,,,,,,,,,,,,,,,,,,,,,,,,,,,,,,,,,,,,,,,,"""Finances,Book keeping""",,Archival,,1,0
13209,https://archive.carpentershall.org/items/show/13209,"General Financial Correspondence",,,,,1978-04-12,,"Financial Issues Correspondence",,,,,,,,,,,,,,,,,,,,,,,,,,,,,,,,,,,,,,,,,,,,,,,,,,,,,,,,,,,,,,,,,,,,,,,,,,,,,,,,,,1859,6Q,16,"Box #122",,"Financial Records",,,,,,,,,,,,,,,,,,,,,,,,,,,,,,,,,,,,,,,,,,,,,,,,,,,,,,,,,,,,,,,,,,,,,,,,,,,,,,,,,,,,,,,,,,,,,,,,"""Finances,Auditor's Report,Long Range Planning""",,Archival,,1,0