﻿"Item Id","Item URI","Dublin Core:Title","Dublin Core:Identifier","Dublin Core:Is Referenced By","Dublin Core:Alternative Title","Dublin Core:Creator","Dublin Core:Date","Dublin Core:Description","Dublin Core:Subject","Dublin Core:Spatial Coverage","Dublin Core:Extent","Dublin Core:Medium","Dublin Core:Format","Dublin Core:Rights","Dublin Core:Language","Dublin Core:Type","Dublin Core:Has Format","Dublin Core:Has Version","Dublin Core:Source","Dublin Core:Publisher","Dublin Core:Contributor","Dublin Core:Relation","Dublin Core:Coverage","Dublin Core:Abstract","Dublin Core:Table Of Contents","Dublin Core:Date Available","Dublin Core:Date Created","Dublin Core:Date Accepted","Dublin Core:Date Copyrighted","Dublin Core:Date Submitted","Dublin Core:Date Issued","Dublin Core:Date Modified","Dublin Core:Date Valid","Dublin Core:Access Rights","Dublin Core:License","Dublin Core:Conforms To","Dublin Core:Has Part","Dublin Core:Is Format Of","Dublin Core:Is Part Of","Dublin Core:Is Replaced By","Dublin Core:Is Required By","Dublin Core:Is Version Of","Dublin Core:References","Dublin Core:Replaces","Dublin Core:Requires","Dublin Core:Bibliographic Citation","Dublin Core:Temporal Coverage","Dublin Core:Accrual Method","Dublin Core:Accrual Periodicity","Dublin Core:Accrual Policy","Dublin Core:Audience","Dublin Core:Audience Education Level","Dublin Core:Mediator","Dublin Core:Instructional Method","Dublin Core:Provenance","Dublin Core:Rights Holder","Item Type Metadata:Text","Item Type Metadata:Interviewer","Item Type Metadata:Interviewee","Item Type Metadata:Location","Item Type Metadata:Transcription","Item Type Metadata:Local URL","Item Type Metadata:Original Format","Item Type Metadata:Physical Dimensions","Item Type Metadata:Duration","Item Type Metadata:Compression","Item Type Metadata:Producer","Item Type Metadata:Director","Item Type Metadata:Bit Rate/Frequency","Item Type Metadata:Time Summary","Item Type Metadata:Email Body","Item Type Metadata:Subject Line","Item Type Metadata:From","Item Type Metadata:To","Item Type Metadata:CC","Item Type Metadata:BCC","Item Type Metadata:Number of Attachments","Item Type Metadata:Standards","Item Type Metadata:Objectives","Item Type Metadata:Materials","Item Type Metadata:Lesson Plan Text","Item Type Metadata:URL","Item Type Metadata:Event Type","Item Type Metadata:Participants","Item Type Metadata:Birth Date","Item Type Metadata:Birthplace","Item Type Metadata:Death Date","Item Type Metadata:Occupation","Item Type Metadata:Biographical Text","Item Type Metadata:Bibliography","Item Type Metadata:Legacy Record Number","Item Type Metadata:Series Code","Item Type Metadata:File Number","Item Type Metadata:Shelf Location","Item Type Metadata:Microfilm","Item Type Metadata:Series","Item Type Metadata:1827 Catalog","Item Type Metadata:1840 Catalog","Item Type Metadata:1857 Catalog","Item Type Metadata:1857 Inventory","Item Type Metadata:1894 Catalog","Item Type Metadata:1894 Inventory","Item Type Metadata:Accession Number","Item Type Metadata:Binding Condition","Item Type Metadata:Binding","Item Type Metadata:Condition","Item Type Metadata:Conservation Assessment","Item Type Metadata:Conservation Comment","Item Type Metadata:Conservation Source","Item Type Metadata:Conservation","Item Type Metadata:Copy","Item Type Metadata:Cover","Item Type Metadata:Enclosure Condition","Item Type Metadata:Enclosure Type","Item Type Metadata:Housing","Item Type Metadata:Inclusions","Item Type Metadata:Inscriptions","Item Type Metadata:Publisher Location","Item Type Metadata:Paper","Item Type Metadata:Post 1894 Catalog / Inventory","Item Type Metadata:Treatment","Item Type Metadata:Value","Item Type Metadata:Volume","Item Type Metadata:Cataloged By","Item Type Metadata:History","Item Type Metadata:Markings","Item Type Metadata:Negative Number","Item Type Metadata:Measurements","Item Type Metadata:Photo Roll Number","Item Type Metadata:Present Location","Item Type Metadata:Reference","Item Type Metadata:See Also","Item Type Metadata:Where Made","Item Type Metadata:Date Cataloged","Item Type Metadata:AIA Photo Number","Item Type Metadata:Inventory","Item Type Metadata:Slide Number","Item Type Metadata:Additional Data","Item Type Metadata:Affiliated Members of Company","Item Type Metadata:Application Date","Item Type Metadata:Office Held","Item Type Metadata:Committee Membership","Item Type Metadata:Brochures, etc.","Item Type Metadata:Business Name","Item Type Metadata:Children","Item Type Metadata:Where Born","Item Type Metadata:Civic Activities","Item Type Metadata:Deceased Date","Item Type Metadata:Descendant","Item Type Metadata:Education","Item Type Metadata:Date Elected","Item Type Metadata:Date Expelled","Item Type Metadata:Father","Item Type Metadata:First Name","Item Type Metadata:Last Name","Item Type Metadata:Listings","Item Type Metadata:Married","Item Type Metadata:Member Number","Item Type Metadata:Middle Name","Item Type Metadata:Military","Item Type Metadata:Mother","Item Type Metadata:Nominator","Item Type Metadata:Nonprofit Directorships","Item Type Metadata:Notes","Item Type Metadata:Other Affiliations","Item Type Metadata:Personal Background","Item Type Metadata:Professional Activities","Item Type Metadata:Project","Item Type Metadata:Date Resigned","Item Type Metadata:Revolutionary War","Item Type Metadata:Seconder","Item Type Metadata:Spouse Born","Item Type Metadata:Spouse Name","Item Type Metadata:Name Suffix","Item Type Metadata:Clubs","Item Type Metadata:Senior Status","Item Type Metadata:Video Interview","Item Type Metadata:Grantor Records Notes","Item Type Metadata:Deed Granted to","Item Type Metadata:Defendant/Sheriff's Sale Notes","Item Type Metadata:Defendant/Sheriff's Sale to","Item Type Metadata:Descendant Address","Item Type Metadata:Business Address","Item Type Metadata:Home Address","Item Type Metadata:Telephone","Item Type Metadata:Member in 1775","Item Type Metadata:No Signature","Item Type Metadata:APS Item Number","Item Type Metadata:Box","Item Type Metadata:Item Location","Item Type Metadata:Transcription Source",tags,file,itemType,collection,public,featured
13998,https://archive.carpentershall.org/items/show/13998,"Correspondence re: the Placement of the Federal Ediice After the Bicentennial Parade",,,,,1990-06-11,,"Federal Edifice Float",,,,,,,,,,"Leon Clemmer",,,,,,,,,,,,,,,,,,,,,,,,,,,,,,,,,,,,,,,,,,,,,,,,,,,,,,,,,,,,,,,,,,,,,,,,2648,7I,9,"Box 140",,Buildings,,,,,,,,,,,,,,,,,,,,,,,,,,,,,,,,,,,,,,,,,,,,,,,,,,,,,,,,,,,,,,,,,,,,,,,,,,,,,,,,,,,,,,,,,,,,,,,,"Commemorative Events,Correspondence,History",,Archival,,1,0
13999,https://archive.carpentershall.org/items/show/13999,"Misc. re: Vintage Flages of America's 18th Century Allies to Adorn the Edifice",,,,,1987-04-24,,"Federal Edifice Float",,,,,,,,,,"Leon Clemmer",,,,,,,,,,,,,,,,,,,,,,,,,,,,,,,,,,,,,,,,,,,,,,,,,,,,,,,,,,,,,,,,,,,,,,,,2649,7I,10,"Box 140",,Buildings,,,,,,,,,,,,,,,,,,,,,,,,,,,,,,,,,,,,,,,,,,,,,,,,,,,,,,,,,,,,,,,,,,,,,,,,,,,,,,,,,,,,,,,,,,,,,,,,"Commemorative Events,History",,Archival,,1,0
14000,https://archive.carpentershall.org/items/show/14000,"Information re: the Architectural Ornamentation of the Edifice",,,,,1987-02-03|circa,,"Federal Edifice Float",,,,,,,,,,"Leon Clemmer",,,,,,,,,,,,,,,,,,,,,,,,,,,,,,,,,,,,,,,,,,,,,,,,,,,,,,,,,,,,,,,,,,,,,,,,2650,7I,11,"Box 140",,Buildings,,,,,,,,,,,,,,,,,,,,,,,,,,,,,,,,,,,,,,,,,,,,,,,,,,,,,,,,,,,,,,,,,,,,,,,,,,,,,,,,,,,,,,,,,,,,,,,,"Commemorative Events,History",,Archival,,1,0
14001,https://archive.carpentershall.org/items/show/14001,"Edifice: Surviving Exerpt of a Speech re: the Bicentennial Parade",,,,,circa,,"Federal Edifice Float",,,,,,,,,,"Leon Clemmer",,,,,,,,,,,,,,,,,,,,,,,,,,,,,,,,,,,,,,,,,,,,,,,,,,,,,,,,,,,,,,,,,,,,,,,,2651,7I,12,"Box 140",,Buildings,,,,,,,,,,,,,,,,,,,,,,,,,,,,,,,,,,,,,,,,,,,,,,,,,,,,,,,,,,,,,,,,,,,,,,,,,,,,,,,,,,,,,,,,,,,,,,,,"Commemorative Events,History",,Archival,,1,0
14002,https://archive.carpentershall.org/items/show/14002,"Publicity for the Bicentennial Parade",,,,,circa,,"Federal Edifice Float",,,,,,,,,,"Leon Clemmer",,,,,,,,,,,,,,,,,,,,,,,,,,,,,,,,,,,,,,,,,,,,,,,,,,,,,,,,,,,,,,,,,,,,,,,,2652,7I,13,"Box 140",,Buildings,,,,,,,,,,,,,,,,,,,,,,,,,,,,,,,,,,,,,,,,,,,,,,,,,,,,,,,,,,,,,,,,,,,,,,,,,,,,,,,,,,,,,,,,,,,,,,,,"Commemorative Events,History",,Archival,,1,0
14003,https://archive.carpentershall.org/items/show/14003,"Edifice: Archival Photographs and Copies of Archival Photographs",,,,,1989-01-01|circa,,"Federal Edifice Float",,,,,,,,,,"Leon Clemmer",,,,,,,,,,,,,,,,,,,,,,,,,,,,,,,,,,,,,,,,,,,,,,,,,,,,,,,,,,,,,,,,,,,,,,,,2653,7I,14,"Box 140",,Buildings,,,,,,,,,,,,,,,,,,,,,,,,,,,,,,,,,,,,,,,,,,,,,,,,,,,,,,,,,,,,,,,,,,,,,,,,,,,,,,,,,,,,,,,,,,,,,,,,"Commemorative Events,History,Prints and photographs",,Archival,,1,0
14004,https://archive.carpentershall.org/items/show/14004,"Edifice: Press Releases re: Bicentennial Parade",,,,,1987-07-28,,"Federal Edifice Float",,,,,,,,,,"Leon Clemmer",,,,,,,,,,,,,,,,,,,,,,,,,,,,,,,,,,,,,,,,,,,,,,,,,,,,,,,,,,,,,,,,,,,,,,,,2654,7I,15,"Box 140",,Buildings,,,,,,,,,,,,,,,,,,,,,,,,,,,,,,,,,,,,,,,,,,,,,,,,,,,,,,,,,,,,,,,,,,,,,,,,,,,,,,,,,,,,,,,,,,,,,,,,"Commemorative Events,History",,Archival,,1,0
14005,https://archive.carpentershall.org/items/show/14005,"Edifice: Parade Costumes",,,,,1989-01-13,,"Federal Edifice Float",,,,,,,,,,"Leon Clemmer",,,,,,,,,,,,,,,,,,,,,,,,,,,,,,,,,,,,,,,,,,,,,,,,,,,,,,,,,,,,,,,,,,,,,,,,2655,7I,16,"Box 140",,Buildings,,,,,,,,,,,,,,,,,,,,,,,,,,,,,,,,,,,,,,,,,,,,,,,,,,,,,,,,,,,,,,,,,,,,,,,,,,,,,,,,,,,,,,,,,,,,,,,,"Commemorative Events,History",,Archival,,1,0
14006,https://archive.carpentershall.org/items/show/14006,"Miscellany re: a Replica of the Carpenters' Company Banner of 1782 Carried in the 1987 Bicentennial Parade and the 1989 Inaugural Parade",,,,,1987-03-11,,"Federal Edifice Float",,,,,,,,,,"Leon Clemmer",,,,,,,,,,,,,,,,,,,,,,,,,,,,,,,,,,,,,,,,,,,,,,,,,,,,,,,,,,,,,,,,,,,,,,,,2656,7I,17,"Box 140",,Buildings,,,,,,,,,,,,,,,,,,,,,,,,,,,,,,,,,,,,,,,,,,,,,,,,,,,,,,,,,,,,,,,,,,,,,,,,,,,,,,,,,,,,,,,,,,,,,,,,"Commemorative Events,History",,Archival,,1,0
14007,https://archive.carpentershall.org/items/show/14007,"Newspaper Article from the Philadelphia Inquirer re: the Appointment of Willard G. Rouse as Chairman and Chief Executive Officer of We the People 200",,,,,,,"Federal Edifice Float",,,,,,,,,,"Leon Clemmer",,,,,,,,,,,,,,,,,,,,,,,,,,,,,,,,,,,,,,,,,,,,,,,,,,,,,,,,,,,,,,,,,,,,,,,,2657,7I,18,"Box 140",,Buildings,,,,,,,,,,,,,,,,,,,,,,,,,,,,,,,,,,,,,,,,,,,,,,,,,,,,,,,,,,,,,,,,,,,,,,,,,,,,,,,,,,,,,,,,,,,,,,,,"Commemorative Events,History",,Archival,,1,0
14008,https://archive.carpentershall.org/items/show/14008,"Edifice: News Clippings and Misc. Articles from 1987",,,,,1987-12-01,,"Federal Edifice Float",,,,,,,,,,"Leon Clemmer",,,,,,,,,,,,,,,,,,,,,,,,,,,,,,,,,,,,,,,,,,,,,,,,,,,,,,,,,,,,,,,,,,,,,,,,2658,7I,19,"Box 140",,Buildings,,,,,,,,,,,,,,,,,,,,,,,,,,,,,,,,,,,,,,,,,,,,,,,,,,,,,,,,,,,,,,,,,,,,,,,,,,,,,,,,,,,,,,,,,,,,,,,,"Commemorative Events,History",,Archival,,1,0
14009,https://archive.carpentershall.org/items/show/14009,"Invitation from the Delaware Valley Chapter of the Architectural Woodwork Institute to a Celebration of the Grand Federal Edifice",,,,,circa,,"Federal Edifice Float",,,,,,,,,,"Leon Clemmer",,,,,,,,,,,,,,,,,,,,,,,,,,,,,,,,,,,,,,,,,,,,,,,,,,,,,,,,,,,,,,,,,,,,,,,,2659,7I,20,"Box 140",,Buildings,,,,,,,,,,,,,,,,,,,,,,,,,,,,,,,,,,,,,,,,,,,,,,,,,,,,,,,,,,,,,,,,,,,,,,,,,,,,,,,,,,,,,,,,,,,,,,,,"Commemorative Events,History",,Archival,,1,0
14010,https://archive.carpentershall.org/items/show/14010,"General Summaries re: the Edifices of 1788, 1887, 1987",,,,,1987-09-01,,"Federal Edifice Float",,,,,,,,,,"Leon Clemmer",,,,,,,,,,,,,,,,,,,,,,,,,,,,,,,,,,,,,,,,,,,,,,,,,,,,,,,,,,,,,,,,,,,,,,,,2660,7I,21,"Box 140",,Buildings,,,,,,,,,,,,,,,,,,,,,,,,,,,,,,,,,,,,,,,,,,,,,,,,,,,,,,,,,,,,,,,,,,,,,,,,,,,,,,,,,,,,,,,,,,,,,,,,"Commemorative Events,History",,Archival,,1,0
14011,https://archive.carpentershall.org/items/show/14011,"News Clippings re: Status of Edifice after Bicentennial Parade",,,,,1988-10-07|circa,,"Federal Edifice Float",,,,,,,,,,"Leon Clemmer",,,,,,,,,,,,,,,,,,,,,,,,,,,,,,,,,,,,,,,,,,,,,,,,,,,,,,,,,,,,,,,,,,,,,,,,2661,7I,22,"Box 140",,Buildings,,,,,,,,,,,,,,,,,,,,,,,,,,,,,,,,,,,,,,,,,,,,,,,,,,,,,,,,,,,,,,,,,,,,,,,,,,,,,,,,,,,,,,,,,,,,,,,,"Commemorative Events,History",,Archival,,1,0
14012,https://archive.carpentershall.org/items/show/14012,"We the People 200 Folder Containing Constitution Week Brouchure and Contact Sheet of the Edifice",,,,,circa,,"Federal Edifice Float",,,,,,,,,,"Leon Clemmer",,,,,,,,,,,,,,,,,,,,,,,,,,,,,,,,,,,,,,,,,,,,,,,,,,,,,,,,,,,,,,,,,,,,,,,,2662,7I,23,"Box 140",,Buildings,,,,,,,,,,,,,,,,,,,,,,,,,,,,,,,,,,,,,,,,,,,,,,,,,,,,,,,,,,,,,,,,,,,,,,,,,,,,,,,,,,,,,,,,,,,,,,,,"Commemorative Events,History,Prints and photographs",,Archival,,1,0
14013,https://archive.carpentershall.org/items/show/14013,"Newspaper Articles re: the Bicentennial Celebration of the Constitution in 1987",,,,,1987-09-23,,"Federal Edifice Float",,,,,,,,,,"Leon Clemmer",,,,,,,,,,,,,,,,,,,,,,,,,,,,,,,,,,,,,,,,,,,,,,,,,,,,,,,,,,,,,,,,,,,,,,,,2663,7I,24,"Box 140",,Buildings,,,,,,,,,,,,,,,,,,,,,,,,,,,,,,,,,,,,,,,,,,,,,,,,,,,,,,,,,,,,,,,,,,,,,,,,,,,,,,,,,,,,,,,,,,,,,,,,"Commemorative Events,History",,Archival,,1,0
14014,https://archive.carpentershall.org/items/show/14014,"Transparency of Federal Edifice in Bicentennial Parade",,,,,,,"Federal Edifice Float",,,,,,,,,,"Leon Clemmer",,,,,,,,,,,,,,,,,,,,,,,,,,,,,,,,,,,,,,,,,,,,,,,,,,,,,,,,,,,,,,,,,,,,,,,,2664,7I,25,"Box 140",,Buildings,,,,,,,,,,,,,,,,,,,,,,,,,,,,,,,,,,,,,,,,,,,,,,,,,,,,,,,,,,,,,,,,,,,,,,,,,,,,,,,,,,,,,,,,,,,,,,,,"Commemorative Events,History,Prints and photographs",,Archival,,1,0
14015,https://archive.carpentershall.org/items/show/14015,"Photos and Copies of Photos of Edifice in Bicentennial Parade",,,,,1988-04-19,,"Federal Edifice Float",,,,,,,,,,"Leon Clemmer",,,,,,,,,,,,,,,,,,,,,,,,,,,,,,,,,,,,,,,,,,,,,,,,,,,,,,,,,,,,,,,,,,,,,,,,2665,7I,26,"Box 140",,Buildings,,,,,,,,,,,,,,,,,,,,,,,,,,,,,,,,,,,,,,,,,,,,,,,,,,,,,,,,,,,,,,,,,,,,,,,,,,,,,,,,,,,,,,,,,,,,,,,,"Commemorative Events,History,Prints and photographs",,Archival,,1,0
14016,https://archive.carpentershall.org/items/show/14016,"Misc. re: the Preservation of the Edifice",,,,,1987-09-25,,"Federal Edifice Float",,,,,,,,,,"Leon Clemmer",,,,,,,,,,,,,,,,,,,,,,,,,,,,,,,,,,,,,,,,,,,,,,,,,,,,,,,,,,,,,,,,,,,,,,,,2666,7I,27,"Box 140",,Buildings,,,,,,,,,,,,,,,,,,,,,,,,,,,,,,,,,,,,,,,,,,,,,,,,,,,,,,,,,,,,,,,,,,,,,,,,,,,,,,,,,,,,,,,,,,,,,,,,"Commemorative Events,History",,Archival,,1,0
14017,https://archive.carpentershall.org/items/show/14017,"Edifice: Misc. Parade Expenses",,,,,1989-01-01,,"Federal Edifice Float",,,,,,,,,,"Leon Clemmer",,,,,,,,,,,,,,,,,,,,,,,,,,,,,,,,,,,,,,,,,,,,,,,,,,,,,,,,,,,,,,,,,,,,,,,,2667,7I,28,"Box 140",,Buildings,,,,,,,,,,,,,,,,,,,,,,,,,,,,,,,,,,,,,,,,,,,,,,,,,,,,,,,,,,,,,,,,,,,,,,,,,,,,,,,,,,,,,,,,,,,,,,,,"Bills and receipts,Commemorative Events,History",,Archival,,1,0
14018,https://archive.carpentershall.org/items/show/14018,"License Agreement between the City of Philadelphia and the Carpenters' Company re: the City's Acceptance of the Title to the Federal Edifice from the Carpenter's Company",,,,,circa,,"Federal Edifice Float",,,,,,,,,,"Leon Clemmer",,,,,,,,,,,,,,,,,,,,,,,,,,,,,,,,,,,,,,,,,,,,,,,,,,,,,,,,,,,,,,,,,,,,,,,,2668,7I,1,"Box 141",,Buildings,,,,,,,,,,,,,,,,,,,,,,,,,,,,,,,,,,,,,,,,,,,,,,,,,,,,,,,,,,,,,,,,,,,,,,,,,,,,,,,,,,,,,,,,,,,,,,,,"Commemorative Events,History",,Archival,,1,0
14019,https://archive.carpentershall.org/items/show/14019,"Edifice: 1988 Correspondence",,,,,1988-12-28,,"Federal Edifice Float",,,,,,,,,,"Leon Clemmer",,,,,,,,,,,,,,,,,,,,,,,,,,,,,,,,,,,,,,,,,,,,,,,,,,,,,,,,,,,,,,,,,,,,,,,,2669,7I,2,"Box 141",,Buildings,,,,,,,,,,,,,,,,,,,,,,,,,,,,,,,,,,,,,,,,,,,,,,,,,,,,,,,,,,,,,,,,,,,,,,,,,,,,,,,,,,,,,,,,,,,,,,,,"Commemorative Events,Correspondence,History",,Archival,,1,0
14020,https://archive.carpentershall.org/items/show/14020,"New York Times Article re: the Arthur Ross Award Presented to the Architectural Woodwork Institute of Hulmeville, Pennsylvania for their work on the Edifice",,,,,,,"Federal Edifice Float",,,,,,,,,,"Leon Clemmer",,,,,,,,,,,,,,,,,,,,,,,,,,,,,,,,,,,,,,,,,,,,,,,,,,,,,,,,,,,,,,,,,,,,,,,,2670,7I,3,"Box 141",,Buildings,,,,,,,,,,,,,,,,,,,,,,,,,,,,,,,,,,,,,,,,,,,,,,,,,,,,,,,,,,,,,,,,,,,,,,,,,,,,,,,,,,,,,,,,,,,,,,,,"Commemorative Events,History",,Archival,,1,0
14021,https://archive.carpentershall.org/items/show/14021,"Article from the Eastern National Park and Monument Association re: the Edifice",,,,,,,"Federal Edifice Float",,,,,,,,,,"Leon Clemmer",,,,,,,,,,,,,,,,,,,,,,,,,,,,,,,,,,,,,,,,,,,,,,,,,,,,,,,,,,,,,,,,,,,,,,,,2671,7I,4,"Box 141",,Buildings,,,,,,,,,,,,,,,,,,,,,,,,,,,,,,,,,,,,,,,,,,,,,,,,,,,,,,,,,,,,,,,,,,,,,,,,,,,,,,,,,,,,,,,,,,,,,,,,"Commemorative Events,History",,Archival,,1,0
14022,https://archive.carpentershall.org/items/show/14022,"Color Photos of Leon Clemmer receiving a Plaque re: the Edifice from the Architectural Woodwork Institute and a Copy of a Detail of the Inscription",,,,,,,"Federal Edifice Float",,,,,,,,,,"Leon Clemmer",,,,,,,,,,,,,,,,,,,,,,,,,,,,,,,,,,,,,,,,,,,,,,,,,,,,,,,,,,,,,,,,,,,,,,,,2672,7I,5,"Box 141",,Buildings,,,,,,,,,,,,,,,,,,,,,,,,,,,,,,,,,,,,,,,,,,,,,,,,,,,,,,,,,,,,,,,,,,,,,,,,,,,,,,,,,,,,,,,,,,,,,,,,"Commemorative Events,History,Prints and photographs",,Archival,,1,0
14023,https://archive.carpentershall.org/items/show/14023,"Edifice: Press Release re: President Bush's Inaugural Parade",,,,,1989-01-01,,"Federal Edifice Float",,,,,,,,,,"Leon Clemmer",,,,,,,,,,,,,,,,,,,,,,,,,,,,,,,,,,,,,,,,,,,,,,,,,,,,,,,,,,,,,,,,,,,,,,,,2673,7I,6,"Box 141",,Buildings,,,,,,,,,,,,,,,,,,,,,,,,,,,,,,,,,,,,,,,,,,,,,,,,,,,,,,,,,,,,,,,,,,,,,,,,,,,,,,,,,,,,,,,,,,,,,,,,"Commemorative Events,History",,Archival,,1,0
14024,https://archive.carpentershall.org/items/show/14024,"News Clipping re: the Edifice",,,,,circa,,"Federal Edifice Float",,,,,,,,,,"Leon Clemmer",,,,,,,,,,,,,,,,,,,,,,,,,,,,,,,,,,,,,,,,,,,,,,,,,,,,,,,,,,,,,,,,,,,,,,,,2674,7I,7,"Box 141",,Buildings,,,,,,,,,,,,,,,,,,,,,,,,,,,,,,,,,,,,,,,,,,,,,,,,,,,,,,,,,,,,,,,,,,,,,,,,,,,,,,,,,,,,,,,,,,,,,,,,"Commemorative Events,History",,Archival,,1,0
14025,https://archive.carpentershall.org/items/show/14025,"Inaugural Parade Business",,,,,1989-09-26|circa,,"Federal Edifice Float",,,,,,,,,,"Leon Clemmer",,,,,,,,,,,,,,,,,,,,,,,,,,,,,,,,,,,,,,,,,,,,,,,,,,,,,,,,,,,,,,,,,,,,,,,,2675,7I,8,"Box 141",,Buildings,,,,,,,,,,,,,,,,,,,,,,,,,,,,,,,,,,,,,,,,,,,,,,,,,,,,,,,,,,,,,,,,,,,,,,,,,,,,,,,,,,,,,,,,,,,,,,,,"Commemorative Events,History",,Archival,,1,0
14026,https://archive.carpentershall.org/items/show/14026,"List of People Requesting Pictures of the Edifice",,,,,circa,,"Federal Edifice Float",,,,,,,,,,"Leon Clemmer",,,,,,,,,,,,,,,,,,,,,,,,,,,,,,,,,,,,,,,,,,,,,,,,,,,,,,,,,,,,,,,,,,,,,,,,2676,7I,9,"Box 141",,Buildings,,,,,,,,,,,,,,,,,,,,,,,,,,,,,,,,,,,,,,,,,,,,,,,,,,,,,,,,,,,,,,,,,,,,,,,,,,,,,,,,,,,,,,,,,,,,,,,,"Commemorative Events,History",,Archival,,1,0
14027,https://archive.carpentershall.org/items/show/14027,"Edifice Information Packet for the Presidential Inaugural",,,,,circa,,"Federal Edifice Float",,,,,,,,,,"Leon Clemmer",,,,,,,,,,,,,,,,,,,,,,,,,,,,,,,,,,,,,,,,,,,,,,,,,,,,,,,,,,,,,,,,,,,,,,,,2677,7I,10,"Box 141",,Buildings,,,,,,,,,,,,,,,,,,,,,,,,,,,,,,,,,,,,,,,,,,,,,,,,,,,,,,,,,,,,,,,,,,,,,,,,,,,,,,,,,,,,,,,,,,,,,,,,"Commemorative Events,History",,Archival,,1,0
14028,https://archive.carpentershall.org/items/show/14028,"Edifice: News Clippings re: President Bush's Parade",,,,,circa,,"Federal Edifice Float",,,,,,,,,,"Leon Clemmer",,,,,,,,,,,,,,,,,,,,,,,,,,,,,,,,,,,,,,,,,,,,,,,,,,,,,,,,,,,,,,,,,,,,,,,,2678,7I,11,"Box 141",,Buildings,,,,,,,,,,,,,,,,,,,,,,,,,,,,,,,,,,,,,,,,,,,,,,,,,,,,,,,,,,,,,,,,,,,,,,,,,,,,,,,,,,,,,,,,,,,,,,,,"Commemorative Events,History",,Archival,,1,0
14029,https://archive.carpentershall.org/items/show/14029,"Edifice: 1989 Correspondence",,,,,1989-12-22,,"Federal Edifice Float",,,,,,,,,,"Leon Clemmer",,,,,,,,,,,,,,,,,,,,,,,,,,,,,,,,,,,,,,,,,,,,,,,,,,,,,,,,,,,,,,,,,,,,,,,,2679,7I,12,"Box 141",,Buildings,,,,,,,,,,,,,,,,,,,,,,,,,,,,,,,,,,,,,,,,,,,,,,,,,,,,,,,,,,,,,,,,,,,,,,,,,,,,,,,,,,,,,,,,,,,,,,,,"Commemorative Events,Correspondence,History",,Archival,,1,0
14030,https://archive.carpentershall.org/items/show/14030,"Invitation to George Bush's Inaugural",,,,,,,"Federal Edifice Float",,,,,,,,,,"Leon Clemmer",,,,,,,,,,,,,,,,,,,,,,,,,,,,,,,,,,,,,,,,,,,,,,,,,,,,,,,,,,,,,,,,,,,,,,,,2680,7I,13,"Box 141",,Buildings,,,,,,,,,,,,,,,,,,,,,,,,,,,,,,,,,,,,,,,,,,,,,,,,,,,,,,,,,,,,,,,,,,,,,,,,,,,,,,,,,,,,,,,,,,,,,,,,"Commemorative Events,Correspondence,History",,Archival,,1,0
14031,https://archive.carpentershall.org/items/show/14031,"Photos and Copies of Photos of Edifice in President Bush's Inaugural Parade",,,,,,,"Federal Edifice Float",,,,,,,,,,"Leon Clemmer",,,,,,,,,,,,,,,,,,,,,,,,,,,,,,,,,,,,,,,,,,,,,,,,,,,,,,,,,,,,,,,,,,,,,,,,2681,7I,14,"Box 141",,Buildings,,,,,,,,,,,,,,,,,,,,,,,,,,,,,,,,,,,,,,,,,,,,,,,,,,,,,,,,,,,,,,,,,,,,,,,,,,,,,,,,,,,,,,,,,,,,,,,,"Commemorative Events,History,Prints and photographs",,Archival,,1,0
14032,https://archive.carpentershall.org/items/show/14032,"Edifice: Misc. Bills",,,,,1989-03-24,,"Federal Edifice Float",,,,,,,,,,"Leon Clemmer",,,,,,,,,,,,,,,,,,,,,,,,,,,,,,,,,,,,,,,,,,,,,,,,,,,,,,,,,,,,,,,,,,,,,,,,2682,7I,15,"Box 141",,Buildings,,,,,,,,,,,,,,,,,,,,,,,,,,,,,,,,,,,,,,,,,,,,,,,,,,,,,,,,,,,,,,,,,,,,,,,,,,,,,,,,,,,,,,,,,,,,,,,,"Bills and receipts,Commemorative Events,History",,Archival,,1,0
14033,https://archive.carpentershall.org/items/show/14033,"Invoices re: Laser Copying Edifice Material",,,,,1989-04-01,,"Federal Edifice Float",,,,,,,,,,"Leon Clemmer",,,,,,,,,,,,,,,,,,,,,,,,,,,,,,,,,,,,,,,,,,,,,,,,,,,,,,,,,,,,,,,,,,,,,,,,2683,7I,16,"Box 141",,Buildings,,,,,,,,,,,,,,,,,,,,,,,,,,,,,,,,,,,,,,,,,,,,,,,,,,,,,,,,,,,,,,,,,,,,,,,,,,,,,,,,,,,,,,,,,,,,,,,,"Bills and receipts,Commemorative Events,History",,Archival,,1,0
14034,https://archive.carpentershall.org/items/show/14034,"Edifice: Misc. Notes",,,,,circa,,"Federal Edifice Float",,,,,,,,,,"Leon Clemmer",,,,,,,,,,,,,,,,,,,,,,,,,,,,,,,,,,,,,,,,,,,,,,,,,,,,,,,,,,,,,,,,,,,,,,,,2684,7I,17,"Box 141",,Buildings,,,,,,,,,,,,,,,,,,,,,,,,,,,,,,,,,,,,,,,,,,,,,,,,,,,,,,,,,,,,,,,,,,,,,,,,,,,,,,,,,,,,,,,,,,,,,,,,"Commemorative Events,History",,Archival,,1,0
14035,https://archive.carpentershall.org/items/show/14035,"Edifice: Furniture Design and Manufactoring Article",,,,,circa,,"Federal Edifice Float",,,,,,,,,,"Leon Clemmer",,,,,,,,,,,,,,,,,,,,,,,,,,,,,,,,,,,,,,,,,,,,,,,,,,,,,,,,,,,,,,,,,,,,,,,,2685,7I,18,"Box 141",,Buildings,,,,,,,,,,,,,,,,,,,,,,,,,,,,,,,,,,,,,,,,,,,,,,,,,,,,,,,,,,,,,,,,,,,,,,,,,,,,,,,,,,,,,,,,,,,,,,,,"Commemorative Events,History",,Archival,,1,0
14036,https://archive.carpentershall.org/items/show/14036,"Edifice: 1990 Correspondence",,,,,1990-10-04,,"Federal Edifice Float",,,,,,,,,,"Leon Clemmer",,,,,,,,,,,,,,,,,,,,,,,,,,,,,,,,,,,,,,,,,,,,,,,,,,,,,,,,,,,,,,,,,,,,,,,,2686,7I,19,"Box 141",,Buildings,,,,,,,,,,,,,,,,,,,,,,,,,,,,,,,,,,,,,,,,,,,,,,,,,,,,,,,,,,,,,,,,,,,,,,,,,,,,,,,,,,,,,,,,,,,,,,,,"Commemorative Events,Correspondence,History",,Archival,,1,0
14037,https://archive.carpentershall.org/items/show/14037,"Edifiece: 1991 Correspondence",,,,,,,"Federal Edifice Float",,,,,,,,,,"Leon Clemmer",,,,,,,,,,,,,,,,,,,,,,,,,,,,,,,,,,,,,,,,,,,,,,,,,,,,,,,,,,,,,,,,,,,,,,,,2687,7I,20,"Box 141",,Buildings,,,,,,,,,,,,,,,,,,,,,,,,,,,,,,,,,,,,,,,,,,,,,,,,,,,,,,,,,,,,,,,,,,,,,,,,,,,,,,,,,,,,,,,,,,,,,,,,"Commemorative Events,Correspondence,History",,Archival,,1,0