﻿"Item Id","Item URI","Dublin Core:Title","Dublin Core:Identifier","Dublin Core:Is Referenced By","Dublin Core:Alternative Title","Dublin Core:Creator","Dublin Core:Date","Dublin Core:Description","Dublin Core:Subject","Dublin Core:Spatial Coverage","Dublin Core:Extent","Dublin Core:Medium","Dublin Core:Format","Dublin Core:Rights","Dublin Core:Language","Dublin Core:Type","Dublin Core:Has Format","Dublin Core:Has Version","Dublin Core:Source","Dublin Core:Publisher","Dublin Core:Contributor","Dublin Core:Relation","Dublin Core:Coverage","Dublin Core:Abstract","Dublin Core:Table Of Contents","Dublin Core:Date Available","Dublin Core:Date Created","Dublin Core:Date Accepted","Dublin Core:Date Copyrighted","Dublin Core:Date Submitted","Dublin Core:Date Issued","Dublin Core:Date Modified","Dublin Core:Date Valid","Dublin Core:Access Rights","Dublin Core:License","Dublin Core:Conforms To","Dublin Core:Has Part","Dublin Core:Is Format Of","Dublin Core:Is Part Of","Dublin Core:Is Replaced By","Dublin Core:Is Required By","Dublin Core:Is Version Of","Dublin Core:References","Dublin Core:Replaces","Dublin Core:Requires","Dublin Core:Bibliographic Citation","Dublin Core:Temporal Coverage","Dublin Core:Accrual Method","Dublin Core:Accrual Periodicity","Dublin Core:Accrual Policy","Dublin Core:Audience","Dublin Core:Audience Education Level","Dublin Core:Mediator","Dublin Core:Instructional Method","Dublin Core:Provenance","Dublin Core:Rights Holder","Item Type Metadata:Text","Item Type Metadata:Interviewer","Item Type Metadata:Interviewee","Item Type Metadata:Location","Item Type Metadata:Transcription","Item Type Metadata:Local URL","Item Type Metadata:Original Format","Item Type Metadata:Physical Dimensions","Item Type Metadata:Duration","Item Type Metadata:Compression","Item Type Metadata:Producer","Item Type Metadata:Director","Item Type Metadata:Bit Rate/Frequency","Item Type Metadata:Time Summary","Item Type Metadata:Email Body","Item Type Metadata:Subject Line","Item Type Metadata:From","Item Type Metadata:To","Item Type Metadata:CC","Item Type Metadata:BCC","Item Type Metadata:Number of Attachments","Item Type Metadata:Standards","Item Type Metadata:Objectives","Item Type Metadata:Materials","Item Type Metadata:Lesson Plan Text","Item Type Metadata:URL","Item Type Metadata:Event Type","Item Type Metadata:Participants","Item Type Metadata:Birth Date","Item Type Metadata:Birthplace","Item Type Metadata:Death Date","Item Type Metadata:Occupation","Item Type Metadata:Biographical Text","Item Type Metadata:Bibliography","Item Type Metadata:Legacy Record Number","Item Type Metadata:Series Code","Item Type Metadata:File Number","Item Type Metadata:Shelf Location","Item Type Metadata:Microfilm","Item Type Metadata:Series","Item Type Metadata:1827 Catalog","Item Type Metadata:1840 Catalog","Item Type Metadata:1857 Catalog","Item Type Metadata:1857 Inventory","Item Type Metadata:1894 Catalog","Item Type Metadata:1894 Inventory","Item Type Metadata:Accession Number","Item Type Metadata:Binding Condition","Item Type Metadata:Binding","Item Type Metadata:Condition","Item Type Metadata:Conservation Assessment","Item Type Metadata:Conservation Comment","Item Type Metadata:Conservation Source","Item Type Metadata:Conservation","Item Type Metadata:Copy","Item Type Metadata:Cover","Item Type Metadata:Enclosure Condition","Item Type Metadata:Enclosure Type","Item Type Metadata:Housing","Item Type Metadata:Inclusions","Item Type Metadata:Inscriptions","Item Type Metadata:Publisher Location","Item Type Metadata:Paper","Item Type Metadata:Post 1894 Catalog / Inventory","Item Type Metadata:Treatment","Item Type Metadata:Value","Item Type Metadata:Volume","Item Type Metadata:Cataloged By","Item Type Metadata:History","Item Type Metadata:Markings","Item Type Metadata:Negative Number","Item Type Metadata:Measurements","Item Type Metadata:Photo Roll Number","Item Type Metadata:Present Location","Item Type Metadata:Reference","Item Type Metadata:See Also","Item Type Metadata:Where Made","Item Type Metadata:Date Cataloged","Item Type Metadata:AIA Photo Number","Item Type Metadata:Inventory","Item Type Metadata:Slide Number","Item Type Metadata:Additional Data","Item Type Metadata:Affiliated Members of Company","Item Type Metadata:Application Date","Item Type Metadata:Office Held","Item Type Metadata:Committee Membership","Item Type Metadata:Brochures, etc.","Item Type Metadata:Business Name","Item Type Metadata:Children","Item Type Metadata:Where Born","Item Type Metadata:Civic Activities","Item Type Metadata:Deceased Date","Item Type Metadata:Descendant","Item Type Metadata:Education","Item Type Metadata:Date Elected","Item Type Metadata:Date Expelled","Item Type Metadata:Father","Item Type Metadata:First Name","Item Type Metadata:Last Name","Item Type Metadata:Listings","Item Type Metadata:Married","Item Type Metadata:Member Number","Item Type Metadata:Middle Name","Item Type Metadata:Military","Item Type Metadata:Mother","Item Type Metadata:Nominator","Item Type Metadata:Nonprofit Directorships","Item Type Metadata:Notes","Item Type Metadata:Other Affiliations","Item Type Metadata:Personal Background","Item Type Metadata:Professional Activities","Item Type Metadata:Project","Item Type Metadata:Date Resigned","Item Type Metadata:Revolutionary War","Item Type Metadata:Seconder","Item Type Metadata:Spouse Born","Item Type Metadata:Spouse Name","Item Type Metadata:Name Suffix","Item Type Metadata:Clubs","Item Type Metadata:Senior Status","Item Type Metadata:Video Interview","Item Type Metadata:Grantor Records Notes","Item Type Metadata:Deed Granted to","Item Type Metadata:Defendant/Sheriff's Sale Notes","Item Type Metadata:Defendant/Sheriff's Sale to","Item Type Metadata:Descendant Address","Item Type Metadata:Business Address","Item Type Metadata:Home Address","Item Type Metadata:Telephone","Item Type Metadata:Member in 1775","Item Type Metadata:No Signature","Item Type Metadata:APS Item Number","Item Type Metadata:Box","Item Type Metadata:Item Location","Item Type Metadata:Transcription Source",tags,file,itemType,collection,public,featured
15912,https://archive.carpentershall.org/items/show/15912,"Maintenance Reimbursement to Managing Committee",,,,,1991,,"Hall Expenses (Utilities & More)",,,,,,,,,,"John K. Ball",,,,,,,,,,,,,,,,,,,,,,,,,,,,,,,,,,,,,,,,,,,,,,,,,,,,,,,,,,,,,,,,,,,,,,,,3864,7J,53,"Box #168",,Buildings,,,,,,,,,,,,,,,,,,,,,,,,,,,,,,,,,,,,,,,,,,,,,,,,,,,,,,,,,,,,,,,,,,,,,,,,,,,,,,,,,,,,,,,,,,,,,,,,"""Maintenance,Committees""",,Archival,,1,0
15898,https://archive.carpentershall.org/items/show/15898,"Audit Committee Report (A Subcommittee of the Managing Committee)",,,,,,,"Auditors' Reports [And Form 990]",,,,,,,,,,"John K. Ball",,,,,,,,,,,,,,,,,,,,,,,,,,,,,,,,,,,,,,,,,,,,,,,,,,,,,,,,,,,,,,,,,,,,,,,,3850,6O,39,"Box #168",,"Financial Records",,,,,,,,,,,,,,,,,,,,,,,,,,,,,,,,,,,,,,,,,,,,,,,,,,,,,,,,,,,,,,,,,,,,,,,,,,,,,,,,,,,,,,,,,,,,,,,,"""Audit,Committees""",,Archival,,1,0
15876,https://archive.carpentershall.org/items/show/15876,"Membership Committee Report to the 4/20/1992 Quarterly Meeting Concerning the Membership Application Procedure",,,,,,,"Committees [Concerning Membership]",,,,,,,,,,"John K. Ball",,,,,,,,,,,,,,,,,,,,,,,,,,,,,,,,,,,,,,,,,,,,,,,,,,,,,,,,,,,,,,,,,,,,,,,,3828,3H,17,"Box #168",,"Membership Records & Rules [Including Individual Members' Data]",,,,,,,,,,,,,,,,,,,,,,,,,,,,,,,,,,,,,,,,,,,,,,,,,,,,,,,,,,,,,,,,,,,,,,,,,,,,,,,,,,,,,,,,,,,,,,,,"""Membership,Committees""",,Archival,,1,0
15861,https://archive.carpentershall.org/items/show/15861,"Nomination Request to Become Chairman of the Managing Committee From James J. Clearkin, III",,,,,,,"Elections/Officers/Appointed Committees",,,,,,,,,,"John K. Ball",,,,,,,,,,,,,,,,,,,,,,,,,,,,,,,,,,,,,,,,,,,,,,,,,,,,,,,,,,,,,,,,,,,,,,,,3813,1C,2,"Box #168",,"Company Minutes [And Related Business]",,,,,,,,,,,,,,,,,,,,,,,,,,,,,,,,,,,,,,,,,,,,,,,,,,,,,,,,,,,,,,,,,,,,,,,,,,,,,,,,,,,,,,,,,,,,,,,,"""Nominations,Committees""",,Archival,,1,0
15680,https://archive.carpentershall.org/items/show/15680,"Historic Restoration Committee Minutes",,,,,1981-03-03,,"Historic Restoration Committee",,,,,,,,,,"Charles Kessler",,,,,,,,,,,,,,,,,,,,,,,,,,,,,,,,,,,,,,,,,,,,,,,,,,,,,,,,,,,,,,,,,,,,,,,,3632,7Q,24,"Box #164",,Buildings,,,,,,,,,,,,,,,,,,,,,,,,,,,,,,,,,,,,,,,,,,,,,,,,,,,,,,,,,,,,,,,,,,,,,,,,,,,,,,,,,,,,,,,,,,,,,,,,"""Restoration,Committees"",Minutes",,Archival,,1,0
15656,https://archive.carpentershall.org/items/show/15656,"Investment Committee",,,,,,,"Investment Committee",,,,,,,,,,"Charles Kessler",,,,,,,,,,,,,,,,,,,,,,,,,,,,,,,,,,,,,,,,,,,,,,,,,,,,,,,,,,,,,,,,,,,,,,,,3608,6V,27,"Box #163",,"Financial Records",,,,,,,,,,,,,,,,,,,,,,,,,,,,,,,,,,,,,,,,,,,,,,,,,,,,,,,,,,,,,,,,,,,,,,,,,,,,,,,,,,,,,,,,,,,,,,,,"""Investments,Committees"",Finance",,Archival,,1,0
15605,https://archive.carpentershall.org/items/show/15605,"Managing Committee Meeting Report By the Special Committee on Gift Shop/Hall Operations",,,,,,,"Managing Committee - Misc./Corres.",,,,,,,,,,"Charles Kessler",,,,,,,,,,,,,,,,,,,,,,,,,,,,,,,,,,,,,,,,,,,,,,,,,,,,,,,,,,,,,,,,,,,,,,,,3557,2E,8,"Box #162",,"Managing Committee And Trustees' Minutes",,,,,,,,,,,,,,,,,,,,,,,,,,,,,,,,,,,,,,,,,,,,,,,,,,,,,,,,,,,,,,,,,,,,,,,,,,,,,,,,,,,,,,,,,,,,,,,,"""Reports,Committees""",,Archival,,1,0
15602,https://archive.carpentershall.org/items/show/15602,"Managing Committee Minutes (Including Treasurer's Reports, Orders Drawn, Members' Dues, Managing Committee Appointments & Proposed Budgets)",,,,,1983-01-10,,"Managing Committee Rough Minutes",,,,,,,,,,"Charles Kessler",,,,,,,,,,,,,,,,,,,,,,,,,,,,,,,,,,,,,,,,,,,,,,,,,,,,,,,,,,,,,,,,,,,,,,,,3554,2B,5,"Box #162",,"Manging Committee And Trustees' Minutes",,,,,,,,,,,,,,,,,,,,,,,,,,,,,,,,,,,,,,,,,,,,,,,,,,,,,,,,,,,,,,,,,,,,,,,,,,,,,,,,,,,,,,,,,,,,,,,,"""Minutes,Committees""",,Archival,,1,0
15590,https://archive.carpentershall.org/items/show/15590,"Long Range Planning Committee",,,,,1989-11-08,,"Long Range Planning/Long Range Planning Committee",,,,,,,,,,"William Hough",,,,,,,,,,,,,,,,,,,,,,,,,,,,,,,,,,,,,,,,,,,,,,,,,,,,,,,,,,,,,,,,,,,,,,,,3542,8L,44,"Box #161",,"Caarpenters' Company Miscellany",,,,,,,,,,,,,,,,,,,,,,,,,,,,,,,,,,,,,,,,,,,,,,,,,,,,,,,,,,,,,,,,,,,,,,,,,,,,,,,,,,,,,,,,,,,,,,,,"""Development,Committees""",,Archival,,1,0
15588,https://archive.carpentershall.org/items/show/15588,"Development Committee",,,,,1991-06-18,,"Development Committee/Endowment Committee (Fundrasing) [Cross Reference with 3A & 6S]",,,,,,,,,,"William Hough",,,,,,,,,,,,,,,,,,,,,,,,,,,,,,,,,,,,,,,,,,,,,,,,,,,,,,,,,,,,,,,,,,,,,,,,3540,8K,42,"Box #161",,"Carpenters' Company Miscellany",,,,,,,,,,,,,,,,,,,,,,,,,,,,,,,,,,,,,,,,,,,,,,,,,,,,,,,,,,,,,,,,,,,,,,,,,,,,,,,,,,,,,,,,,,,,,,,,"""Development,Committees""",,Archival,,1,0
15516,https://archive.carpentershall.org/items/show/15516,"Managing Committee Minutes",,,,,1987-07-08,,"Managing Committee Rough Minutes",,,,,,,,,,"William Hough",,,,,,,,,,,,,,,,,,,,,,,,,,,,,,,,,,,,,,,,,,,,,,,,,,,,,,,,,,,,,,,,,,,,,,,,3468,2B,10,"Box #160",,"Managing Committee And Trustees' Minutes",,,,,,,,,,,,,,,,,,,,,,,,,,,,,,,,,,,,,,,,,,,,,,,,,,,,,,,,,,,,,,,,,,,,,,,,,,,,,,,,,,,,,,,,,,,,,,,,"""Minutes,Committees""",,Archival,,1,0
15505,https://archive.carpentershall.org/items/show/15505,"Collections Committee (Creation of Committee and Report to Annual Meeting)",,,,,1983-01-20,,"Collections Committe/Possessions Sub-Committee/Exhibits Committee [Collections/Exhibits Committee]",,,,,,,,,,JL,,,,,,,,,,,,,,,,,,,,,,,,,,,,,,,,,,,,,,,,,,,,,,,,,,,,,,,,,,,,,,,,,,,,,,,,3457,10J,45,"Box #159",,Collections,,,,,,,,,,,,,,,,,,,,,,,,,,,,,,,,,,,,,,,,,,,,,,,,,,,,,,,,,,,,,,,,,,,,,,,,,,,,,,,,,,,,,,,,,,,,,,,,"""Collections,Committees""",,Archival,,1,0
15504,https://archive.carpentershall.org/items/show/15504,"Possessions Sub-Committee (Minutes and Meeting Notices)",,,,,1982-06-03,,"Collections Committee/Possessions Sub-Committee/Exhibits Committee [Collections/Exhibits Committee]",,,,,,,,,,JL,,,,,,,,,,,,,,,,,,,,,,,,,,,,,,,,,,,,,,,,,,,,,,,,,,,,,,,,,,,,,,,,,,,,,,,,3456,10J,44,"Box #159",,Collections,,,,,,,,,,,,,,,,,,,,,,,,,,,,,,,,,,,,,,,,,,,,,,,,,,,,,,,,,,,,,,,,,,,,,,,,,,,,,,,,,,,,,,,,,,,,,,,,"""Collections,Committees""",,Archival,,1,0
13709,https://archive.carpentershall.org/items/show/13709,"Trustees Report for 1938",,,,,,,"Accounts & Investments (Trustees)",,,,,,,,,,,,,,,,,,,,,,,,,,,,,,,,,,,,,,,,,,,,,,,,,,,,,,,,,,,,,,,,,,,,,,,,,,,,,,,,,,2359,6L,,"Box #79",,"Financial Records",,,,,,,,,,,,,,,,,,,,,,,,,,,,,,,,,,,,,,,,,,,,,,,,,,,,,,,,,,,,,,,,,,,,,,,,,,,,,,,,,,,,,,,,,,,,,,,,"""Trustees reports,Committees""",,Archival,,1,0
13708,https://archive.carpentershall.org/items/show/13708,"Trustees Report for 1937 (2 copies)",,,,,,,"Accounts & Investments (Trustees)",,,,,,,,,,,,,,,,,,,,,,,,,,,,,,,,,,,,,,,,,,,,,,,,,,,,,,,,,,,,,,,,,,,,,,,,,,,,,,,,,,2358,6L,,"Box #79",,"Financial Records",,,,,,,,,,,,,,,,,,,,,,,,,,,,,,,,,,,,,,,,,,,,,,,,,,,,,,,,,,,,,,,,,,,,,,,,,,,,,,,,,,,,,,,,,,,,,,,,"""Trustees Report,Committees""",,Archival,,1,0
13707,https://archive.carpentershall.org/items/show/13707,"Trustees reports for 1936 (draft)",,,,,,,"Accounts & Investments (Trustees)",,,,,,,,,,,,,,,,,,,,,,,,,,,,,,,,,,,,,,,,,,,,,,,,,,,,,,,,,,,,,,,,,,,,,,,,,,,,,,,,,,2357,6L,,"Box #79",,"Financial Records",,,,,,,,,,,,,,,,,,,,,,,,,,,,,,,,,,,,,,,,,,,,,,,,,,,,,,,,,,,,,,,,,,,,,,,,,,,,,,,,,,,,,,,,,,,,,,,,"""Trustees reports,Committees""",,Archival,,1,0
13706,https://archive.carpentershall.org/items/show/13706,"Trustees Report for 1935",,,,,,,"Accounts & Investments (Trustees)",,,,,,,,,,,,,,,,,,,,,,,,,,,,,,,,,,,,,,,,,,,,,,,,,,,,,,,,,,,,,,,,,,,,,,,,,,,,,,,,,,2356,6L,,"Box #79",,"Financial Records",,,,,,,,,,,,,,,,,,,,,,,,,,,,,,,,,,,,,,,,,,,,,,,,,,,,,,,,,,,,,,,,,,,,,,,,,,,,,,,,,,,,,,,,,,,,,,,,"""Trustees reports,Committees""",,Archival,,1,0
13648,https://archive.carpentershall.org/items/show/13648,"Announcements of the elected official and committees to the Carpenters' Company",,,,,,,"Elections / Officers",,,,,,,,,,,,,,,,,,,,,,,,,,,,,,,,,,,,,,,,,,,,,,,,,,,,,,,,,,,,,,,,,,,,,,,,,,,,,,,,,,2298,1C,,"Box #77",,"Company Minutes",,,,,,,,,,,,,,,,,,,,,,,,,,,,,,,,,,,,,,,,,,,,,,,,,,,,,,,,,,,,,,,,,,,,,,,,,,,,,,,,,,,,,,,,,,,,,,,,"""Officers,Committees""",,Archival,,1,0
13613,https://archive.carpentershall.org/items/show/13613,"List of elected officials",,,,,1929-01-01,,"Elections / Officers",,,,,,,,,,,,,,,,,,,,,,,,,,,,,,,,,,,,,,,,,,,,,,,,,,,,,,,,,,,,,,,,,,,,,,,,,,,,,,,,,,2263,1C,,"Box #76",,"Company Minutes",,,,,,,,,,,,,,,,,,,,,,,,,,,,,,,,,,,,,,,,,,,,,,,,,,,,,,,,,,,,,,,,,,,,,,,,,,,,,,,,,,,,,,,,,,,,,,,,"""Officers,Committees""",,Archival,,1,0
13584,https://archive.carpentershall.org/items/show/13584,"Listing of officers and committee members of the Carpenters' Company.",,,,,1921-01-01,,"Elections / Officers",,,,,,,,,,"Company Minutes",,,,,,,,,,,,,,,,,,,,,,,,,,,,,,,,,,,,,,,,,,,,,,,,,,,,,,,,,,,,,,,,,,,,,,,,2234,,,"Box #75",,"series 1.C.",,,,,,,,,,,,,,,,,,,,,,,,,,,,,,,,,,,,,,,,,,,,,,,,,,,,,,,,,,,,,,,,,,,,,,,,,,,,,,,,,,,,,,,,,,,,,,,,"""Officers,Committees""",,Archival,,1,0
13401,https://archive.carpentershall.org/items/show/13401,"Correspondence About Recipient John Aikman's Year in the U.S.",,,,,1974-10-01,,"Exchange Scholarships",,,,,,,,,,"Thomas S. Keefer 99/3a",,,,,,,,,,,,,,,,,,,,,,,,,,,,,,,,,,,,,,,,,,,,,,,,,,,,,,,,,,,,,,,,,,,,,,,,2051,8E,17,"Box #129",,"Carpenters' Company Miscellany",,,,,,,,,,,,,,,,,,,,,,,,,,,,,,,,,,,,,,,,,,,,,,,,,,,,,,,,,,,,,,,,,,,,,,,,,,,,,,,,,,,,,,,,,,,,,,,,"""London Company,Committees""",,Archival,,1,0
13400,https://archive.carpentershall.org/items/show/13400,"Correspondence About Recipient Ian Harper's Year in the U.S.",,,,,1974-04-19,,"Exchange Scholarships",,,,,,,,,,"Thomas S. Keefer 99/3a",,,,,,,,,,,,,,,,,,,,,,,,,,,,,,,,,,,,,,,,,,,,,,,,,,,,,,,,,,,,,,,,,,,,,,,,2050,8E,16,"Box #129",,"Carpenters' Company Miscellany",,,,,,,,,,,,,,,,,,,,,,,,,,,,,,,,,,,,,,,,,,,,,,,,,,,,,,,,,,,,,,,,,,,,,,,,,,,,,,,,,,,,,,,,,,,,,,,,"""London Company,Committees""",,Archival,,1,0
13398,https://archive.carpentershall.org/items/show/13398,"Correspondence About Recipient Edgars Nilenders' Year in London",,,,,1970-05-07,,"Exchange Scholarships",,,,,,,,,,"Thomas S. Keefer 99/3a",,,,,,,,,,,,,,,,,,,,,,,,,,,,,,,,,,,,,,,,,,,,,,,,,,,,,,,,,,,,,,,,,,,,,,,,2048,8E,14,"Box #129",,"Carpenters' Company Miscellany",,,,,,,,,,,,,,,,,,,,,,,,,,,,,,,,,,,,,,,,,,,,,,,,,,,,,,,,,,,,,,,,,,,,,,,,,,,,,,,,,,,,,,,,,,,,,,,,"""London Company,Committees""",,Archival,,1,0
13396,https://archive.carpentershall.org/items/show/13396,"Correspondence About Recipient Alan Garton's Year in London",,,,,1970-01-27,,"Exchange Scholarships",,,,,,,,,,"Thomas S. Keefer 99/3a",,,,,,,,,,,,,,,,,,,,,,,,,,,,,,,,,,,,,,,,,,,,,,,,,,,,,,,,,,,,,,,,,,,,,,,,2046,8E,12,"Box #129",,"Carpenters' Company Miscellany",,,,,,,,,,,,,,,,,,,,,,,,,,,,,,,,,,,,,,,,,,,,,,,,,,,,,,,,,,,,,,,,,,,,,,,,,,,,,,,,,,,,,,,,,,,,,,,,"""London Company,Committees""",,Archival,,1,0
13395,https://archive.carpentershall.org/items/show/13395,"Correspondence About Recipient Ian Cowie's Year in the U.S.",,,,,1970-03-12,,"Exchange Scholarships",,,,,,,,,,"Thomas S. Keefer 99/3a",,,,,,,,,,,,,,,,,,,,,,,,,,,,,,,,,,,,,,,,,,,,,,,,,,,,,,,,,,,,,,,,,,,,,,,,2045,8E,11,"Box #129",,"Carpenters' Company Miscellany",,,,,,,,,,,,,,,,,,,,,,,,,,,,,,,,,,,,,,,,,,,,,,,,,,,,,,,,,,,,,,,,,,,,,,,,,,,,,,,,,,,,,,,,,,,,,,,,"""London Company,Committees""",,Archival,,1,0
13394,https://archive.carpentershall.org/items/show/13394,"Correspondence About Recipient Roger Ashton's Year in the U.S.",,,,,1968-12-31,,"Exchange Scholarships",,,,,,,,,,"Thomas S. Keefer 99/3a & 99/4",,,,,,,,,,,,,,,,,,,,,,,,,,,,,,,,,,,,,,,,,,,,,,,,,,,,,,,,,,,,,,,,,,,,,,,,2044,8E,10,"Box #129",,"Carpenters' Company Miscellany",,,,,,,,,,,,,,,,,,,,,,,,,,,,,,,,,,,,,,,,,,,,,,,,,,,,,,,,,,,,,,,,,,,,,,,,,,,,,,,,,,,,,,,,,,,,,,,,"""London Company,Committees""",,Archival,,1,0
13393,https://archive.carpentershall.org/items/show/13393,"Recipient Roger Ashton's Sample Portfolio",,,,,circa,,"Exchange Scholarships",,,,,,,,,,"Thomas S. Keefer 99/3a",,,,,,,,,,,,,,,,,,,,,,,,,,,,,,,,,,,,,,,,,,,,,,,,,,,,,,,,,,,,,,,,,,,,,,,,2043,8E,9,"Box #129",,"Carpenters' Company Miscellany",,,,,,,,,,,,,,,,,,,,,,,,,,,,,,,,,,,,,,,,,,,,,,,,,,,,,,,,,,,,,,,,,,,,,,,,,,,,,,,,,,,,,,,,,,,,,,,,"""London Company,Committees""",,Archival,,1,0
13391,https://archive.carpentershall.org/items/show/13391,"Correspondence & Reports from Recipient Donald Newby during his year in London",,,,,1967-06-08,,"Exchange Scholarships",,,,,,,,,,"Thomas S. Keefer 99/3a",,,,,,,,,,,,,,,,,,,,,,,,,,,,,,,,,,,,,,,,,,,,,,,,,,,,,,,,,,,,,,,,,,,,,,,,2041,8E,7,"Box #129",,"Carpenters' Company Miscellany",,,,,,,,,,,,,,,,,,,,,,,,,,,,,,,,,,,,,,,,,,,,,,,,,,,,,,,,,,,,,,,,,,,,,,,,,,,,,,,,,,,,,,,,,,,,,,,,"""London Company,Committees""",,Archival,,1,0
13388,https://archive.carpentershall.org/items/show/13388,"Miscellaneous Oddities (Re: other educational or employment opportunities)",,,,,circa,,"Exchange Scholarships",,,,,,,,,,"Thomas S. Keefer 99/3a",,,,,,,,,,,,,,,,,,,,,,,,,,,,,,,,,,,,,,,,,,,,,,,,,,,,,,,,,,,,,,,,,,,,,,,,2038,8E,4,"Box #129",,"Carpenters' Company Miscellany",,,,,,,,,,,,,,,,,,,,,,,,,,,,,,,,,,,,,,,,,,,,,,,,,,,,,,,,,,,,,,,,,,,,,,,,,,,,,,,,,,,,,,,,,,,,,,,,"""London Company,Committees""",,Archival,,1,0
13384,https://archive.carpentershall.org/items/show/13384,"Corres. re: Recipient Eve Sinclair Corken's year in Philadphia",,,,,1980-09-17|circa,,"Exchange Scholarships",,,,,,,,,,"Thomas S. Keefer 99/3a",,,,,,,,,,,,,,,,,,,,,,,,,,,,,,,,,,,,,,,,,,,,,,,,,,,,,,,,,,,,,,,,,,,,,,,,2034,8E,23,"Box #128",,"Carpenters' Company Miscellany",,,,,,,,,,,,,,,,,,,,,,,,,,,,,,,,,,,,,,,,,,,,,,,,,,,,,,,,,,,,,,,,,,,,,,,,,,,,,,,,,,,,,,,,,,,,,,,,"""London Company,Committees"",Scholarships",,Archival,,1,0
13383,https://archive.carpentershall.org/items/show/13383,"Correspondence About Recipient William Pointer's Year in Philadelphia",,,,,,,"Exchange Scholarships",,,,,,,,,,"Thomas S. Keefer 100/26",,,,,,,,,,,,,,,,,,,,,,,,,,,,,,,,,,,,,,,,,,,,,,,,,,,,,,,,,,,,,,,,,,,,,,,,2033,8E,22,"Box #128",,"Carpenters' Company Miscellany",,,,,,,,,,,,,,,,,,,,,,,,,,,,,,,,,,,,,,,,,,,,,,,,,,,,,,,,,,,,,,,,,,,,,,,,,,,,,,,,,,,,,,,,,,,,,,,,"""London Company,Committees"",Scholarships",,Archival,,1,0
13382,https://archive.carpentershall.org/items/show/13382,"Correspondence About Recipient Donald Newby's year in London",,,,,1967-08-25,,"Exchange Scholarships",,,,,,,,,,"Thomas S. Keefer 99/3a",,,,,,,,,,,,,,,,,,,,,,,,,,,,,,,,,,,,,,,,,,,,,,,,,,,,,,,,,,,,,,,,,,,,,,,,2032,8E,21,"Box #128",,"Carpenters' Company Miscellany",,,,,,,,,,,,,,,,,,,,,,,,,,,,,,,,,,,,,,,,,,,,,,,,,,,,,,,,,,,,,,,,,,,,,,,,,,,,,,,,,,,,,,,,,,,,,,,,"""London Company,Committees"",Scholarships",,Archival,,1,0
13381,https://archive.carpentershall.org/items/show/13381,"Correspondence About Recipient David Harris's year in the U.S.",,,,,1967-06-19,,"Exchange Scholarships",,,,,,,,,,"Thomas S. Keefer 99/3a",,,,,,,,,,,,,,,,,,,,,,,,,,,,,,,,,,,,,,,,,,,,,,,,,,,,,,,,,,,,,,,,,,,,,,,,2031,8E,20,"Box #128",,"Carpenters' Company Miscellany",,,,,,,,,,,,,,,,,,,,,,,,,,,,,,,,,,,,,,,,,,,,,,,,,,,,,,,,,,,,,,,,,,,,,,,,,,,,,,,,,,,,,,,,,,,,,,,,"""London Company,Committees"",Scholarships",,Archival,,1,0
13380,https://archive.carpentershall.org/items/show/13380,"Press Releases for the Recipients Newby & Siebenson",,,,,1966-08-08,,"Exchange Scholarships",,,,,,,,,,"Thomas S. Keefer 99/3a",,,,,,,,,,,,,,,,,,,,,,,,,,,,,,,,,,,,,,,,,,,,,,,,,,,,,,,,,,,,,,,,,,,,,,,,2030,8E,19,"Box #128",,"Carpenters' Company Miscellany",,,,,,,,,,,,,,,,,,,,,,,,,,,,,,,,,,,,,,,,,,,,,,,,,,,,,,,,,,,,,,,,,,,,,,,,,,,,,,,,,,,,,,,,,,,,,,,,"""London Company,Committees"",Scholarships",,Archival,,1,0
13379,https://archive.carpentershall.org/items/show/13379,"Correspondence About Recipient Bill Siebenson's year in London",,,,,1966-08-29,,"Exchange Scholarships",,,,,,,,,,"Thomas S. Keefer 99/3a",,,,,,,,,,,,,,,,,,,,,,,,,,,,,,,,,,,,,,,,,,,,,,,,,,,,,,,,,,,,,,,,,,,,,,,,2029,8E,18,"Box #128",,"Carpenters' Company Miscellany",,,,,,,,,,,,,,,,,,,,,,,,,,,,,,,,,,,,,,,,,,,,,,,,,,,,,,,,,,,,,,,,,,,,,,,,,,,,,,,,,,,,,,,,,,,,,,,,"""London Company,Committees"",Scholarships",,Archival,,1,0
13378,https://archive.carpentershall.org/items/show/13378,"Correspondence & Reports from Recipient Bill Siebenson during his year in London",,,,,1966-04-04,,"Exchange Scholarships",,,,,,,,,,"Thomas S. Keefer 99/3a",,,,,,,,,,,,,,,,,,,,,,,,,,,,,,,,,,,,,,,,,,,,,,,,,,,,,,,,,,,,,,,,,,,,,,,,2028,8E,17,"Box #128",,"Carpenters' Company Miscellany",,,,,,,,,,,,,,,,,,,,,,,,,,,,,,,,,,,,,,,,,,,,,,,,,,,,,,,,,,,,,,,,,,,,,,,,,,,,,,,,,,,,,,,,,,,,,,,,"""London Company,Committees"",Scholarships",,Archival,,1,0
13377,https://archive.carpentershall.org/items/show/13377,"Correspondence About Recipient Edward Taylor's year in the U.S.",,,,,1965-09-17,,"Exchange Scholarships",,,,,,,,,,"Thomas S. Keefer 99/3a",,,,,,,,,,,,,,,,,,,,,,,,,,,,,,,,,,,,,,,,,,,,,,,,,,,,,,,,,,,,,,,,,,,,,,,,2027,8E,16,"Box #128",,"Carpenters' Company Miscellany",,,,,,,,,,,,,,,,,,,,,,,,,,,,,,,,,,,,,,,,,,,,,,,,,,,,,,,,,,,,,,,,,,,,,,,,,,,,,,,,,,,,,,,,,,,,,,,,"""London Company,Committees"",Scholarships",,Archival,,1,0
13376,https://archive.carpentershall.org/items/show/13376,"Correspondence with Unsuccessful Applicants",,,,,1970-02-04,,"Exchange Scholarships",,,,,,,,,,"Thomas S. Keefer 99/3a",,,,,,,,,,,,,,,,,,,,,,,,,,,,,,,,,,,,,,,,,,,,,,,,,,,,,,,,,,,,,,,,,,,,,,,,2026,8E,15,"Box #128",,"Carpenters' Company Miscellany",,,,,,,,,,,,,,,,,,,,,,,,,,,,,,,,,,,,,,,,,,,,,,,,,,,,,,,,,,,,,,,,,,,,,,,,,,,,,,,,,,,,,,,,,,,,,,,,"""London Company,Committees"",Scholarships",,Archival,,1,0