﻿"Item Id","Item URI","Dublin Core:Title","Dublin Core:Identifier","Dublin Core:Is Referenced By","Dublin Core:Alternative Title","Dublin Core:Creator","Dublin Core:Date","Dublin Core:Description","Dublin Core:Subject","Dublin Core:Spatial Coverage","Dublin Core:Extent","Dublin Core:Medium","Dublin Core:Format","Dublin Core:Rights","Dublin Core:Language","Dublin Core:Type","Dublin Core:Has Format","Dublin Core:Has Version","Dublin Core:Source","Dublin Core:Publisher","Dublin Core:Contributor","Dublin Core:Relation","Dublin Core:Coverage","Dublin Core:Abstract","Dublin Core:Table Of Contents","Dublin Core:Date Available","Dublin Core:Date Created","Dublin Core:Date Accepted","Dublin Core:Date Copyrighted","Dublin Core:Date Submitted","Dublin Core:Date Issued","Dublin Core:Date Modified","Dublin Core:Date Valid","Dublin Core:Access Rights","Dublin Core:License","Dublin Core:Conforms To","Dublin Core:Has Part","Dublin Core:Is Format Of","Dublin Core:Is Part Of","Dublin Core:Is Replaced By","Dublin Core:Is Required By","Dublin Core:Is Version Of","Dublin Core:References","Dublin Core:Replaces","Dublin Core:Requires","Dublin Core:Bibliographic Citation","Dublin Core:Temporal Coverage","Dublin Core:Accrual Method","Dublin Core:Accrual Periodicity","Dublin Core:Accrual Policy","Dublin Core:Audience","Dublin Core:Audience Education Level","Dublin Core:Mediator","Dublin Core:Instructional Method","Dublin Core:Provenance","Dublin Core:Rights Holder","Item Type Metadata:Text","Item Type Metadata:Interviewer","Item Type Metadata:Interviewee","Item Type Metadata:Location","Item Type Metadata:Transcription","Item Type Metadata:Local URL","Item Type Metadata:Original Format","Item Type Metadata:Physical Dimensions","Item Type Metadata:Duration","Item Type Metadata:Compression","Item Type Metadata:Producer","Item Type Metadata:Director","Item Type Metadata:Bit Rate/Frequency","Item Type Metadata:Time Summary","Item Type Metadata:Email Body","Item Type Metadata:Subject Line","Item Type Metadata:From","Item Type Metadata:To","Item Type Metadata:CC","Item Type Metadata:BCC","Item Type Metadata:Number of Attachments","Item Type Metadata:Standards","Item Type Metadata:Objectives","Item Type Metadata:Materials","Item Type Metadata:Lesson Plan Text","Item Type Metadata:URL","Item Type Metadata:Event Type","Item Type Metadata:Participants","Item Type Metadata:Birth Date","Item Type Metadata:Birthplace","Item Type Metadata:Death Date","Item Type Metadata:Occupation","Item Type Metadata:Biographical Text","Item Type Metadata:Bibliography","Item Type Metadata:Legacy Record Number","Item Type Metadata:Series Code","Item Type Metadata:File Number","Item Type Metadata:Shelf Location","Item Type Metadata:Microfilm","Item Type Metadata:Series","Item Type Metadata:1827 Catalog","Item Type Metadata:1840 Catalog","Item Type Metadata:1857 Catalog","Item Type Metadata:1857 Inventory","Item Type Metadata:1894 Catalog","Item Type Metadata:1894 Inventory","Item Type Metadata:Accession Number","Item Type Metadata:Binding Condition","Item Type Metadata:Binding","Item Type Metadata:Condition","Item Type Metadata:Conservation Assessment","Item Type Metadata:Conservation Comment","Item Type Metadata:Conservation Source","Item Type Metadata:Conservation","Item Type Metadata:Copy","Item Type Metadata:Cover","Item Type Metadata:Enclosure Condition","Item Type Metadata:Enclosure Type","Item Type Metadata:Housing","Item Type Metadata:Inclusions","Item Type Metadata:Inscriptions","Item Type Metadata:Publisher Location","Item Type Metadata:Paper","Item Type Metadata:Post 1894 Catalog / Inventory","Item Type Metadata:Treatment","Item Type Metadata:Value","Item Type Metadata:Volume","Item Type Metadata:Cataloged By","Item Type Metadata:History","Item Type Metadata:Markings","Item Type Metadata:Negative Number","Item Type Metadata:Measurements","Item Type Metadata:Photo Roll Number","Item Type Metadata:Present Location","Item Type Metadata:Reference","Item Type Metadata:See Also","Item Type Metadata:Where Made","Item Type Metadata:Date Cataloged","Item Type Metadata:AIA Photo Number","Item Type Metadata:Inventory","Item Type Metadata:Slide Number","Item Type Metadata:Additional Data","Item Type Metadata:Affiliated Members of Company","Item Type Metadata:Application Date","Item Type Metadata:Office Held","Item Type Metadata:Committee Membership","Item Type Metadata:Brochures, etc.","Item Type Metadata:Business Name","Item Type Metadata:Children","Item Type Metadata:Where Born","Item Type Metadata:Civic Activities","Item Type Metadata:Deceased Date","Item Type Metadata:Descendant","Item Type Metadata:Education","Item Type Metadata:Date Elected","Item Type Metadata:Date Expelled","Item Type Metadata:Father","Item Type Metadata:First Name","Item Type Metadata:Last Name","Item Type Metadata:Listings","Item Type Metadata:Married","Item Type Metadata:Member Number","Item Type Metadata:Middle Name","Item Type Metadata:Military","Item Type Metadata:Mother","Item Type Metadata:Nominator","Item Type Metadata:Nonprofit Directorships","Item Type Metadata:Notes","Item Type Metadata:Other Affiliations","Item Type Metadata:Personal Background","Item Type Metadata:Professional Activities","Item Type Metadata:Project","Item Type Metadata:Date Resigned","Item Type Metadata:Revolutionary War","Item Type Metadata:Seconder","Item Type Metadata:Spouse Born","Item Type Metadata:Spouse Name","Item Type Metadata:Name Suffix","Item Type Metadata:Clubs","Item Type Metadata:Senior Status","Item Type Metadata:Video Interview","Item Type Metadata:Grantor Records Notes","Item Type Metadata:Deed Granted to","Item Type Metadata:Defendant/Sheriff's Sale Notes","Item Type Metadata:Defendant/Sheriff's Sale to","Item Type Metadata:Descendant Address","Item Type Metadata:Business Address","Item Type Metadata:Home Address","Item Type Metadata:Telephone","Item Type Metadata:Member in 1775","Item Type Metadata:No Signature","Item Type Metadata:APS Item Number","Item Type Metadata:Box","Item Type Metadata:Item Location","Item Type Metadata:Transcription Source",tags,file,itemType,collection,public,featured
13376,https://archive.carpentershall.org/items/show/13376,"Correspondence with Unsuccessful Applicants",,,,,1970-02-04,,"Exchange Scholarships",,,,,,,,,,"Thomas S. Keefer 99/3a",,,,,,,,,,,,,,,,,,,,,,,,,,,,,,,,,,,,,,,,,,,,,,,,,,,,,,,,,,,,,,,,,,,,,,,,2026,8E,15,"Box #128",,"Carpenters' Company Miscellany",,,,,,,,,,,,,,,,,,,,,,,,,,,,,,,,,,,,,,,,,,,,,,,,,,,,,,,,,,,,,,,,,,,,,,,,,,,,,,,,,,,,,,,,,,,,,,,,"""London Company,Committees"",Scholarships",,Archival,,1,0
13396,https://archive.carpentershall.org/items/show/13396,"Correspondence About Recipient Alan Garton's Year in London",,,,,1970-01-27,,"Exchange Scholarships",,,,,,,,,,"Thomas S. Keefer 99/3a",,,,,,,,,,,,,,,,,,,,,,,,,,,,,,,,,,,,,,,,,,,,,,,,,,,,,,,,,,,,,,,,,,,,,,,,2046,8E,12,"Box #129",,"Carpenters' Company Miscellany",,,,,,,,,,,,,,,,,,,,,,,,,,,,,,,,,,,,,,,,,,,,,,,,,,,,,,,,,,,,,,,,,,,,,,,,,,,,,,,,,,,,,,,,,,,,,,,,"""London Company,Committees""",,Archival,,1,0
13394,https://archive.carpentershall.org/items/show/13394,"Correspondence About Recipient Roger Ashton's Year in the U.S.",,,,,1968-12-31,,"Exchange Scholarships",,,,,,,,,,"Thomas S. Keefer 99/3a & 99/4",,,,,,,,,,,,,,,,,,,,,,,,,,,,,,,,,,,,,,,,,,,,,,,,,,,,,,,,,,,,,,,,,,,,,,,,2044,8E,10,"Box #129",,"Carpenters' Company Miscellany",,,,,,,,,,,,,,,,,,,,,,,,,,,,,,,,,,,,,,,,,,,,,,,,,,,,,,,,,,,,,,,,,,,,,,,,,,,,,,,,,,,,,,,,,,,,,,,,"""London Company,Committees""",,Archival,,1,0
13375,https://archive.carpentershall.org/items/show/13375,"Scholarship Financials (Both Rough & Formal)",,,,,1968-12-31,,"Exchange Scholarships",,,,,,,,,,"Thomas S. Keefer 99/3a & 99/4",,,,,,,,,,,,,,,,,,,,,,,,,,,,,,,,,,,,,,,,,,,,,,,,,,,,,,,,,,,,,,,,,,,,,,,,2025,8E,14,"Box #128",,"Carpenters' Company Miscellany",,,,,,,,,,,,,,,,,,,,,,,,,,,,,,,,,,,,,,,,,,,,,,,,,,,,,,,,,,,,,,,,,,,,,,,,,,,,,,,,,,,,,,,,,,,,,,,,"""London Company,Committees"",Scholarships",,Archival,,1,0
13371,https://archive.carpentershall.org/items/show/13371,"Exchange Scholarship Committee Reports",,,,,1968-01-15,,"Exchange Scholarships",,,,,,,,,,"Thomas S. Keefer 99/3a",,,,,,,,,,,,,,,,,,,,,,,,,,,,,,,,,,,,,,,,,,,,,,,,,,,,,,,,,,,,,,,,,,,,,,,,2021,8E,10,"Box #128",,"Carpenters' Company Miscellany",,,,,,,,,,,,,,,,,,,,,,,,,,,,,,,,,,,,,,,,,,,,,,,,,,,,,,,,,,,,,,,,,,,,,,,,,,,,,,,,,,,,,,,,,,,,,,,,"""London Company,Committees"",Scholarships",,Archival,,1,0
12682,https://archive.carpentershall.org/items/show/12682,"Reports of the Membership Committee to the Company",,,,,1967-12-31,,Committees,,,,,,,,,,"Thomas S. Keefer 99/1",,,,,,,,,,,,,,,,,,,,,,,,,,,,,,,,,,,,,,,,,,,,,,,,,,,,,,,,,,,,,,,,,,,,,,,,1332,3H,13,"Box #108",,"Membership Records & Rules",,,,,,,,,,,,,,,,,,,,,,,,,,,,,,,,,,,,,,,,,,,,,,,,,,,,,,,,,,,,,,,,,,,,,,,,,,,,,,,,,,,,,,,,,,,,,,,,"""Membership,Committees""",,Archival,,1,0
13382,https://archive.carpentershall.org/items/show/13382,"Correspondence About Recipient Donald Newby's year in London",,,,,1967-08-25,,"Exchange Scholarships",,,,,,,,,,"Thomas S. Keefer 99/3a",,,,,,,,,,,,,,,,,,,,,,,,,,,,,,,,,,,,,,,,,,,,,,,,,,,,,,,,,,,,,,,,,,,,,,,,2032,8E,21,"Box #128",,"Carpenters' Company Miscellany",,,,,,,,,,,,,,,,,,,,,,,,,,,,,,,,,,,,,,,,,,,,,,,,,,,,,,,,,,,,,,,,,,,,,,,,,,,,,,,,,,,,,,,,,,,,,,,,"""London Company,Committees"",Scholarships",,Archival,,1,0
13381,https://archive.carpentershall.org/items/show/13381,"Correspondence About Recipient David Harris's year in the U.S.",,,,,1967-06-19,,"Exchange Scholarships",,,,,,,,,,"Thomas S. Keefer 99/3a",,,,,,,,,,,,,,,,,,,,,,,,,,,,,,,,,,,,,,,,,,,,,,,,,,,,,,,,,,,,,,,,,,,,,,,,2031,8E,20,"Box #128",,"Carpenters' Company Miscellany",,,,,,,,,,,,,,,,,,,,,,,,,,,,,,,,,,,,,,,,,,,,,,,,,,,,,,,,,,,,,,,,,,,,,,,,,,,,,,,,,,,,,,,,,,,,,,,,"""London Company,Committees"",Scholarships",,Archival,,1,0
13391,https://archive.carpentershall.org/items/show/13391,"Correspondence & Reports from Recipient Donald Newby during his year in London",,,,,1967-06-08,,"Exchange Scholarships",,,,,,,,,,"Thomas S. Keefer 99/3a",,,,,,,,,,,,,,,,,,,,,,,,,,,,,,,,,,,,,,,,,,,,,,,,,,,,,,,,,,,,,,,,,,,,,,,,2041,8E,7,"Box #129",,"Carpenters' Company Miscellany",,,,,,,,,,,,,,,,,,,,,,,,,,,,,,,,,,,,,,,,,,,,,,,,,,,,,,,,,,,,,,,,,,,,,,,,,,,,,,,,,,,,,,,,,,,,,,,,"""London Company,Committees""",,Archival,,1,0
12681,https://archive.carpentershall.org/items/show/12681,"Reports to the Membership Committee (Similar to Minutes)",,,,,1967-01-09,,Committees,,,,,,,,,,"Thomas S. Keefer 99/1",,,,,,,,,,,,,,,,,,,,,,,,,,,,,,,,,,,,,,,,,,,,,,,,,,,,,,,,,,,,,,,,,,,,,,,,1331,3H,12,"Box #108",,"Membership Records & Rules",,,,,,,,,,,,,,,,,,,,,,,,,,,,,,,,,,,,,,,,,,,,,,,,,,,,,,,,,,,,,,,,,,,,,,,,,,,,,,,,,,,,,,,,,,,,,,,,"""Membership,Committees""",,Archival,,1,0
12680,https://archive.carpentershall.org/items/show/12680,"Membership Committee - List of Committee Members",,,,,1967-01-09,,Committees,,,,,,,,,,"Thomas S. Keefer 99/1",,,,,,,,,,,,,,,,,,,,,,,,,,,,,,,,,,,,,,,,,,,,,,,,,,,,,,,,,,,,,,,,,,,,,,,,1330,3H,11,"Box #108",,"Membership Records & Rules",,,,,,,,,,,,,,,,,,,,,,,,,,,,,,,,,,,,,,,,,,,,,,,,,,,,,,,,,,,,,,,,,,,,,,,,,,,,,,,,,,,,,,,,,,,,,,,,"""Membership,Committees""",,Archival,,1,0
13379,https://archive.carpentershall.org/items/show/13379,"Correspondence About Recipient Bill Siebenson's year in London",,,,,1966-08-29,,"Exchange Scholarships",,,,,,,,,,"Thomas S. Keefer 99/3a",,,,,,,,,,,,,,,,,,,,,,,,,,,,,,,,,,,,,,,,,,,,,,,,,,,,,,,,,,,,,,,,,,,,,,,,2029,8E,18,"Box #128",,"Carpenters' Company Miscellany",,,,,,,,,,,,,,,,,,,,,,,,,,,,,,,,,,,,,,,,,,,,,,,,,,,,,,,,,,,,,,,,,,,,,,,,,,,,,,,,,,,,,,,,,,,,,,,,"""London Company,Committees"",Scholarships",,Archival,,1,0
13380,https://archive.carpentershall.org/items/show/13380,"Press Releases for the Recipients Newby & Siebenson",,,,,1966-08-08,,"Exchange Scholarships",,,,,,,,,,"Thomas S. Keefer 99/3a",,,,,,,,,,,,,,,,,,,,,,,,,,,,,,,,,,,,,,,,,,,,,,,,,,,,,,,,,,,,,,,,,,,,,,,,2030,8E,19,"Box #128",,"Carpenters' Company Miscellany",,,,,,,,,,,,,,,,,,,,,,,,,,,,,,,,,,,,,,,,,,,,,,,,,,,,,,,,,,,,,,,,,,,,,,,,,,,,,,,,,,,,,,,,,,,,,,,,"""London Company,Committees"",Scholarships",,Archival,,1,0
13378,https://archive.carpentershall.org/items/show/13378,"Correspondence & Reports from Recipient Bill Siebenson during his year in London",,,,,1966-04-04,,"Exchange Scholarships",,,,,,,,,,"Thomas S. Keefer 99/3a",,,,,,,,,,,,,,,,,,,,,,,,,,,,,,,,,,,,,,,,,,,,,,,,,,,,,,,,,,,,,,,,,,,,,,,,2028,8E,17,"Box #128",,"Carpenters' Company Miscellany",,,,,,,,,,,,,,,,,,,,,,,,,,,,,,,,,,,,,,,,,,,,,,,,,,,,,,,,,,,,,,,,,,,,,,,,,,,,,,,,,,,,,,,,,,,,,,,,"""London Company,Committees"",Scholarships",,Archival,,1,0
13374,https://archive.carpentershall.org/items/show/13374,"First Year's Announcements as made by the CCCCP",,,,,1965-12-31,,"Exchange Scholarships",,,,,,,,,,"Thomas S. Keefer 99/3a",,,,,,,,,,,,,,,,,,,,,,,,,,,,,,,,,,,,,,,,,,,,,,,,,,,,,,,,,,,,,,,,,,,,,,,,2024,8E,13,"Box #128",,"Carpenters' Company Miscellany",,,,,,,,,,,,,,,,,,,,,,,,,,,,,,,,,,,,,,,,,,,,,,,,,,,,,,,,,,,,,,,,,,,,,,,,,,,,,,,,,,,,,,,,,,,,,,,,"""London Company,Committees"",Scholarships",,Archival,,1,0
13373,https://archive.carpentershall.org/items/show/13373,"Final Statement of Scholarship Program Rules",,,,,1965-12-31,,"Exchange Scholarships",,,,,,,,,,"Thomas S. Keefer 99/3a",,,,,,,,,,,,,,,,,,,,,,,,,,,,,,,,,,,,,,,,,,,,,,,,,,,,,,,,,,,,,,,,,,,,,,,,2023,8E,12,"Box #128",,"Carpenters' Company Miscellany",,,,,,,,,,,,,,,,,,,,,,,,,,,,,,,,,,,,,,,,,,,,,,,,,,,,,,,,,,,,,,,,,,,,,,,,,,,,,,,,,,,,,,,,,,,,,,,,"""London Company,Committees"",Scholarships",,Archival,,1,0
13377,https://archive.carpentershall.org/items/show/13377,"Correspondence About Recipient Edward Taylor's year in the U.S.",,,,,1965-09-17,,"Exchange Scholarships",,,,,,,,,,"Thomas S. Keefer 99/3a",,,,,,,,,,,,,,,,,,,,,,,,,,,,,,,,,,,,,,,,,,,,,,,,,,,,,,,,,,,,,,,,,,,,,,,,2027,8E,16,"Box #128",,"Carpenters' Company Miscellany",,,,,,,,,,,,,,,,,,,,,,,,,,,,,,,,,,,,,,,,,,,,,,,,,,,,,,,,,,,,,,,,,,,,,,,,,,,,,,,,,,,,,,,,,,,,,,,,"""London Company,Committees"",Scholarships",,Archival,,1,0
12701,https://archive.carpentershall.org/items/show/12701,"Report of the Library Committee",,,,,1965-01-18,,"Library Committee Reports",,,,,,,,,,"Thomas S. Keefer 99/2",,,,,,,,,,,,,,,,,,,,,,,,,,,,,,,,,,,,,,,,,,,,,,,,,,,,,,,,,,,,,,,,,,,,,,,,1351,5E,32,"Box #108",,"Library Records",,,,,,,,,,,,,,,,,,,,,,,,,,,,,,,,,,,,,,,,,,,,,,,,,,,,,,,,,,,,,,,,,,,,,,,,,,,,,,,,,,,,,,,,,,,,,,,,"""Library,Committees""",,Archival,,1,0
13372,https://archive.carpentershall.org/items/show/13372,"Planning Stages - Correspondence & Memoranda",,,,,1964-08-14,,"Exchange Scholarships",,,,,,,,,,"Thomas S. Keefer 99/3a",,,,,,,,,,,,,,,,,,,,,,,,,,,,,,,,,,,,,,,,,,,,,,,,,,,,,,,,,,,,,,,,,,,,,,,,2022,8E,11,"Box #128",,"Carpenters' Company Miscellany",,,,,,,,,,,,,,,,,,,,,,,,,,,,,,,,,,,,,,,,,,,,,,,,,,,,,,,,,,,,,,,,,,,,,,,,,,,,,,,,,,,,,,,,,,,,,,,,"""London Company,Committees"",Scholarships",,Archival,,1,0
13370,https://archive.carpentershall.org/items/show/13370,"Planning Stages - Correspondence & Memoranda",,,,,1963-12-16,,"Exchange Scholarships",,,,,,,,,,"Thomas S. Keefer 99/3a",,,,,,,,,,,,,,,,,,,,,,,,,,,,,,,,,,,,,,,,,,,,,,,,,,,,,,,,,,,,,,,,,,,,,,,,2020,8E,9,"Box #128",,"Carpenters' Company Miscellany",,,,,,,,,,,,,,,,,,,,,,,,,,,,,,,,,,,,,,,,,,,,,,,,,,,,,,,,,,,,,,,,,,,,,,,,,,,,,,,,,,,,,,,,,,,,,,,,"""London Company,Committees"",Scholarships",,Archival,,1,0
12549,https://archive.carpentershall.org/items/show/12549,"Correspondence re: Quarterly Meeting Program",,,,,1958-01-01,,"Invitations to Quarterly Meetings",,,,,,,,,,,,,,,,,,,,,,,,,,,,,,,,,,,,,,,,,,,,,,,,,,,,,,,,,,,,,,,,,,,,,,,,,,,,,,,,,,1199,1B,7,"Box #106",,"Company Minutes",,,,,,,,,,,,,,,,,,,,,,,,,,,,,,,,,,,,,,,,,,,,,,,,,,,,,,,,,,,,,,,,,,,,,,,,,,,,,,,,,,,,,,,,,,,,,,,,"""Meetings,Committees""",,Archival,,1,0
12592,https://archive.carpentershall.org/items/show/12592,"Rules of the Membership Committee",,,,,1952-01-21|circa,,By-Laws,,,,,,,,,,"Thomas S. Keefer 99/10",,,,,,,,,,,,,,,,,,,,,,,,,,,,,,,,,,,,,,,,,,,,,,,,,,,,,,,,,,,,,,,,,,,,,,,,1242,3C,8,"Box #107",,"Membership Records & Rules",,,,,,,,,,,,,,,,,,,,,,,,,,,,,,,,,,,,,,,,,,,,,,,,,,,,,,,,,,,,,,,,,,,,,,,,,,,,,,,,,,,,,,,,,,,,,,,,"""Membership,Committees""",,Archival,,1,0
12573,https://archive.carpentershall.org/items/show/12573,"Rough Minutes of Managing Committee (Handwritten, Loose Leaf)",,,,,1951-01-03,,"Managing Committee Rough Minutes",,,,,,,,,,,,,,,,,,,,,,,,,,,,,,,,,,,,,,,,,,,,,,,,,,,,,,,,,,,,,,,,,,,,,,,,,,,,,,,,,,1223,2B,31,"Box #106",,"Managing Committee & Trustees' Minutes",,,,,,,,,,,,,,,,,,,,,,,,,,,,,,,,,,,,,,,,,,,,,,,,,,,,,,,,,,,,,,,,,,,,,,,,,,,,,,,,,,,,,,,,,,,,,,,,"""Meetings,Committees"",Minutes",,Archival,,1,0
13613,https://archive.carpentershall.org/items/show/13613,"List of elected officials",,,,,1929-01-01,,"Elections / Officers",,,,,,,,,,,,,,,,,,,,,,,,,,,,,,,,,,,,,,,,,,,,,,,,,,,,,,,,,,,,,,,,,,,,,,,,,,,,,,,,,,2263,1C,,"Box #76",,"Company Minutes",,,,,,,,,,,,,,,,,,,,,,,,,,,,,,,,,,,,,,,,,,,,,,,,,,,,,,,,,,,,,,,,,,,,,,,,,,,,,,,,,,,,,,,,,,,,,,,,"""Officers,Committees""",,Archival,,1,0
13584,https://archive.carpentershall.org/items/show/13584,"Listing of officers and committee members of the Carpenters' Company.",,,,,1921-01-01,,"Elections / Officers",,,,,,,,,,"Company Minutes",,,,,,,,,,,,,,,,,,,,,,,,,,,,,,,,,,,,,,,,,,,,,,,,,,,,,,,,,,,,,,,,,,,,,,,,2234,,,"Box #75",,"series 1.C.",,,,,,,,,,,,,,,,,,,,,,,,,,,,,,,,,,,,,,,,,,,,,,,,,,,,,,,,,,,,,,,,,,,,,,,,,,,,,,,,,,,,,,,,,,,,,,,,"""Officers,Committees""",,Archival,,1,0
