﻿"Item Id","Item URI","Dublin Core:Title","Dublin Core:Identifier","Dublin Core:Is Referenced By","Dublin Core:Alternative Title","Dublin Core:Creator","Dublin Core:Date","Dublin Core:Description","Dublin Core:Subject","Dublin Core:Spatial Coverage","Dublin Core:Extent","Dublin Core:Medium","Dublin Core:Format","Dublin Core:Rights","Dublin Core:Language","Dublin Core:Type","Dublin Core:Has Format","Dublin Core:Has Version","Dublin Core:Source","Dublin Core:Publisher","Dublin Core:Contributor","Dublin Core:Relation","Dublin Core:Coverage","Dublin Core:Abstract","Dublin Core:Table Of Contents","Dublin Core:Date Available","Dublin Core:Date Created","Dublin Core:Date Accepted","Dublin Core:Date Copyrighted","Dublin Core:Date Submitted","Dublin Core:Date Issued","Dublin Core:Date Modified","Dublin Core:Date Valid","Dublin Core:Access Rights","Dublin Core:License","Dublin Core:Conforms To","Dublin Core:Has Part","Dublin Core:Is Format Of","Dublin Core:Is Part Of","Dublin Core:Is Replaced By","Dublin Core:Is Required By","Dublin Core:Is Version Of","Dublin Core:References","Dublin Core:Replaces","Dublin Core:Requires","Dublin Core:Bibliographic Citation","Dublin Core:Temporal Coverage","Dublin Core:Accrual Method","Dublin Core:Accrual Periodicity","Dublin Core:Accrual Policy","Dublin Core:Audience","Dublin Core:Audience Education Level","Dublin Core:Mediator","Dublin Core:Instructional Method","Dublin Core:Provenance","Dublin Core:Rights Holder","Item Type Metadata:Text","Item Type Metadata:Interviewer","Item Type Metadata:Interviewee","Item Type Metadata:Location","Item Type Metadata:Transcription","Item Type Metadata:Local URL","Item Type Metadata:Original Format","Item Type Metadata:Physical Dimensions","Item Type Metadata:Duration","Item Type Metadata:Compression","Item Type Metadata:Producer","Item Type Metadata:Director","Item Type Metadata:Bit Rate/Frequency","Item Type Metadata:Time Summary","Item Type Metadata:Email Body","Item Type Metadata:Subject Line","Item Type Metadata:From","Item Type Metadata:To","Item Type Metadata:CC","Item Type Metadata:BCC","Item Type Metadata:Number of Attachments","Item Type Metadata:Standards","Item Type Metadata:Objectives","Item Type Metadata:Materials","Item Type Metadata:Lesson Plan Text","Item Type Metadata:URL","Item Type Metadata:Event Type","Item Type Metadata:Participants","Item Type Metadata:Birth Date","Item Type Metadata:Birthplace","Item Type Metadata:Death Date","Item Type Metadata:Occupation","Item Type Metadata:Biographical Text","Item Type Metadata:Bibliography","Item Type Metadata:Legacy Record Number","Item Type Metadata:Series Code","Item Type Metadata:File Number","Item Type Metadata:Shelf Location","Item Type Metadata:Microfilm","Item Type Metadata:Series","Item Type Metadata:1827 Catalog","Item Type Metadata:1840 Catalog","Item Type Metadata:1857 Catalog","Item Type Metadata:1857 Inventory","Item Type Metadata:1894 Catalog","Item Type Metadata:1894 Inventory","Item Type Metadata:Accession Number","Item Type Metadata:Binding Condition","Item Type Metadata:Binding","Item Type Metadata:Condition","Item Type Metadata:Conservation Assessment","Item Type Metadata:Conservation Comment","Item Type Metadata:Conservation Source","Item Type Metadata:Conservation","Item Type Metadata:Copy","Item Type Metadata:Cover","Item Type Metadata:Enclosure Condition","Item Type Metadata:Enclosure Type","Item Type Metadata:Housing","Item Type Metadata:Inclusions","Item Type Metadata:Inscriptions","Item Type Metadata:Publisher Location","Item Type Metadata:Paper","Item Type Metadata:Post 1894 Catalog / Inventory","Item Type Metadata:Treatment","Item Type Metadata:Value","Item Type Metadata:Volume","Item Type Metadata:Cataloged By","Item Type Metadata:History","Item Type Metadata:Markings","Item Type Metadata:Negative Number","Item Type Metadata:Measurements","Item Type Metadata:Photo Roll Number","Item Type Metadata:Present Location","Item Type Metadata:Reference","Item Type Metadata:See Also","Item Type Metadata:Where Made","Item Type Metadata:Date Cataloged","Item Type Metadata:AIA Photo Number","Item Type Metadata:Inventory","Item Type Metadata:Slide Number","Item Type Metadata:Additional Data","Item Type Metadata:Affiliated Members of Company","Item Type Metadata:Application Date","Item Type Metadata:Office Held","Item Type Metadata:Committee Membership","Item Type Metadata:Brochures, etc.","Item Type Metadata:Business Name","Item Type Metadata:Children","Item Type Metadata:Where Born","Item Type Metadata:Civic Activities","Item Type Metadata:Deceased Date","Item Type Metadata:Descendant","Item Type Metadata:Education","Item Type Metadata:Date Elected","Item Type Metadata:Date Expelled","Item Type Metadata:Father","Item Type Metadata:First Name","Item Type Metadata:Last Name","Item Type Metadata:Listings","Item Type Metadata:Married","Item Type Metadata:Member Number","Item Type Metadata:Middle Name","Item Type Metadata:Military","Item Type Metadata:Mother","Item Type Metadata:Nominator","Item Type Metadata:Nonprofit Directorships","Item Type Metadata:Notes","Item Type Metadata:Other Affiliations","Item Type Metadata:Personal Background","Item Type Metadata:Professional Activities","Item Type Metadata:Project","Item Type Metadata:Date Resigned","Item Type Metadata:Revolutionary War","Item Type Metadata:Seconder","Item Type Metadata:Spouse Born","Item Type Metadata:Spouse Name","Item Type Metadata:Name Suffix","Item Type Metadata:Clubs","Item Type Metadata:Senior Status","Item Type Metadata:Video Interview","Item Type Metadata:Grantor Records Notes","Item Type Metadata:Deed Granted to","Item Type Metadata:Defendant/Sheriff's Sale Notes","Item Type Metadata:Defendant/Sheriff's Sale to","Item Type Metadata:Descendant Address","Item Type Metadata:Business Address","Item Type Metadata:Home Address","Item Type Metadata:Telephone","Item Type Metadata:Member in 1775","Item Type Metadata:No Signature","Item Type Metadata:APS Item Number","Item Type Metadata:Box","Item Type Metadata:Item Location","Item Type Metadata:Transcription Source",tags,file,itemType,collection,public,featured
11706,https://archive.carpentershall.org/items/show/11706,"A packet of 33 pages written by Charles Peterson, regarding the history and composition of Carpenters' Hall",,,,,1950's,,"20th Century Publications",,,,,,,,,,"H. Mather Lippincott",,,,,,,,,,,,,,,,,,,,,,,,,,,,,,,,,,,,,,,,,,,,,,,,,,,,,,,,,,,,,,,,,,,,,,,,356,5H,77,"Box # 172",,"Library Records",,,,,,,,,,,,,,,,,,,,,,,,,,,,,,,,,,,,,,,,,,,,,,,,,,,,,,,,,,,,,,,,,,,,,,,,,,,,,,,,,,,,,,,,,,,,,,,,"1950's,carpenters' hall,charles peterson,library",,Archival,,1,0
11670,https://archive.carpentershall.org/items/show/11670,"A recap of the amount due Philadelphia Chapter A.I.A. in connection with ""The Beginnings of Philadelphia""",,,,,1958-05-16,,"20th Century Publications",,,,,,,,,,"H. Mather Lippincott",,,,,,,,,,,,,,,,,,,,,,,,,,,,,,,,,,,,,,,,,,,,,,,,,,,,,,,,,,,,,,,,,,,,,,,,320,5H,53,"Box # 172",,"Library Records",,,,,,,,,,,,,,,,,,,,,,,,,,,,,,,,,,,,,,,,,,,,,,,,,,,,,,,,,,,,,,,,,,,,,,,,,,,,,,,,,,,,,,,,,,,,,,,,"1958,library",,Archival,,1,0
11705,https://archive.carpentershall.org/items/show/11705,"Advertisement for a book that is comprised of the architecture of Richardson Brognard Okie in Philadelphia",,,,,1905-05-09,,"20th Century Publications",,,,,,,,,,"H. Mather Lippincott",,,,,,,,,,,,,,,,,,,,,,,,,,,,,,,,,,,,,,,,,,,,,,,,,,,,,,,,,,,,,,,,,,,,,,,,355,5H,76,"Box # 172",,"Library Records",,,,,,,,,,,,,,,,,,,,,,,,,,,,,,,,,,,,,,,,,,,,,,,,,,,,,,,,,,,,,,,,,,,,,,,,,,,,,,,,,,,,,,,,,,,,,,,,"1956,library",,Archival,,1,0
11650,https://archive.carpentershall.org/items/show/11650,"Advertisement obviously ripped from a larger piece of paper dealing with the CCCCP/A.I.A. book",,,,,1957-1961,,"20th Century Publications",,,,,,,,,,"H. Mather Lippincott",,,,,,,,,,,,,,,,,,,,,,,,,,,,,,,,,,,,,,,,,,,,,,,,,,,,,,,,,,,,,,,,,,,,,,,,300,5H,35,"Box # 172",,"Library Records",,,,,,,,,,,,,,,,,,,,,,,,,,,,,,,,,,,,,,,,,,,,,,,,,,,,,,,,,,,,,,,,,,,,,,,,,,,,,,,,,,,,,,,,,,,,,,,,"1961,library",,Archival,,1,0
12040,https://archive.carpentershall.org/items/show/12040,"Agenda for the April 14, 1999 Library Committee Meeting",,,,,1999-04-09,,"Library Committee Business & Correspondence",,,,,,,,,,"E. Fred Brecher",,,,,,,,,,,,,,,,,,,,,,,,,,,,,,,,,,,,,,,,,,,,,,,,,,,,,,,,,,,,,,,,,,,,,,,,690,5F,49,"Box # 173",,"Library Records",,,,,,,,,,,,,,,,,,,,,,,,,,,,,,,,,,,,,,,,,,,,,,,,,,,,,,,,,,,,,,,,,,,,,,,,,,,,,,,,,,,,,,,,,,,,,,,,"1999,library,library committee",,Archival,,1,0
14682,https://archive.carpentershall.org/items/show/14682,"Agreement between CC & Chilton Book Company",,,,,10/2/1974,,"Misc. Corres. related to Library",,,,,,,,,,"Leon Clemmer",,,,,,,,,,,,,,,,,,,,,,,,,,,,,,,,,,,,,,,,,,,,,,,,,,,,,,,,,,,,,,,,,,,,,,,,3087,5N,18,"Box 151",,"Library Records",,,,,,,,,,,,,,,,,,,,,,,,,,,,,,,,,,,,,,,,,,,,,,,,,,,,,,,,,,,,,,,,,,,,,,,,,,,,,,,,,,,,,,,,,,,,,,,,"Book Committee,Chilton Book Company,library",,Archival,,1,0
11698,https://archive.carpentershall.org/items/show/11698,"Announcement and information regarding the A.I.A./ CCCCP book, ""The Beginnings of Philadelphia""",,,,,1905-05-11,,"20th Century Publications",,,,,,,,,,"H. Mather Lippincott",,,,,,,,,,,,,,,,,,,,,,,,,,,,,,,,,,,,,,,,,,,,,,,,,,,,,,,,,,,,,,,,,,,,,,,,348,5H,72,"Box # 172",,"Library Records",,,,,,,,,,,,,,,,,,,,,,,,,,,,,,,,,,,,,,,,,,,,,,,,,,,,,,,,,,,,,,,,,,,,,,,,,,,,,,,,,,,,,,,,,,,,,,,,"1958,library",,Archival,,1,0
11760,https://archive.carpentershall.org/items/show/11760,"Announcement for Library Nights at the Hall",,,,,1977-02-28,,"Repairs/ Restoration/ Maintenance",,,,,,,,,,"H. Mather Lippincott",,,,,,,,,,,,,,,,,,,,,,,,,,,,,,,,,,,,,,,,,,,,,,,,,,,,,,,,,,,,,,,,,,,,,,,,410,7N,34,"Box # 173",,Buildings,,,,,,,,,,,,,,,,,,,,,,,,,,,,,,,,,,,,,,,,,,,,,,,,,,,,,,,,,,,,,,,,,,,,,,,,,,,,,,,,,,,,,,,,,,,,,,,,"1977,carpenters' hall,library",,Archival,,1,0
13411,https://archive.carpentershall.org/items/show/13411,"Apprenticeship Training Award - Corres. to Paul D. Highland, Dennis J. McGinnis Jr., Walter Chekay Jr.",,,,,1970-11-12,,"Apprentice Programs",,,,,,,,,,"Thomas S. Keefer 99/12",,,,,,,,,,,,,,,,,,,,,,,,,,,,,,,,,,,,,,,,,,,,,,,,,,,,,,,,,,,,,,,,,,,,,,,,2061,8H,27,"Box #129",,"Carpenters' Company Miscellany",,,,,,,,,,,,,,,,,,,,,,,,,,,,,,,,,,,,,,,,,,,,,,,,,,,,,,,,,,,,,,,,,,,,,,,,,,,,,,,,,,,,,,,,,,,,,,,,"""History,Commemorative Events,library,Repairs and restoration",,Archival,,1,0
12715,https://archive.carpentershall.org/items/show/12715,"APS Deposit Records",,,,,,,"Library Committee Business & Correspondence",,,,,,,,,,"Thomas S. Keefer 100/14",,,,,,,,,,,,,,,,,,,,,,,,,,,,,,,,,,,,,,,,,,,,,,,,,,,,,,,,,,,,,,,,,,,,,,,,1365,5F,46,"Box #108",,"Library Records",,,,,,,,,,,,,,,,,,,,,,,,,,,,,,,,,,,,,,,,,,,,,,,,,,,,,,,,,,,,,,,,,,,,,,,,,,,,,,,,,,,,,,,,,,,,,,,,"""Committees,Correspondence,library",,Archival,,1,0
11623,https://archive.carpentershall.org/items/show/11623,"Basic Rules for Researchers and CCCCP Members [dealing with Library use with attached Application for use]",,,,,1980's,,"Library Committee Business and Correspondence",,,,,,,,,,"H. Mather Lippincott",,,,,,,,,,,,,,,,,,,,,,,,,,,,,,,,,,,,,,,,,,,,,,,,,,,,,,,,,,,,,,,,,,,,,,,,273,5F,8,"Box # 172",,"Library Records",,,,,,,,,,,,,,,,,,,,,,,,,,,,,,,,,,,,,,,,,,,,,,,,,,,,,,,,,,,,,,,,,,,,,,,,,,,,,,,,,,,,,,,,,,,,,,,,"1980's,library",,Archival,,1,0
11819,https://archive.carpentershall.org/items/show/11819,"Blue two-fold brochure for the ""Delegates' Library"" (the Library Company of Piladelphia) from May 15-October 23, 1987",,,,,1905-06-09,,"Misc. Other Companies",,,,,,,,,,"H. Mather Lippincott",,,,,,,,,,,,,,,,,,,,,,,,,,,,,,,,,,,,,,,,,,,,,,,,,,,,,,,,,,,,,,,,,,,,,,,,469,9G,49,"Box # 173",,"Other Companies",,,,,,,,,,,,,,,,,,,,,,,,,,,,,,,,,,,,,,,,,,,,,,,,,,,,,,,,,,,,,,,,,,,,,,,,,,,,,,,,,,,,,,,,,,,,,,,,"1987,library,publicity",,Archival,,1,0
13415,https://archive.carpentershall.org/items/show/13415,"Bound Carpenters' Company History & Documentation",,,,,1954-01-01,,"Company History / Hall History",,,,,,,,,,,,,,,,,,,,,,,,,,,,,,,,,,,,,,,,,,,,,,,,,,,,,,,,,,,,,,,,,,,,,,,,,,,,,,,,,,2065,5J,31,"Box #129",,"Library Records",,,,,,,,,,,,,,,,,,,,,,,,,,,,,,,,,,,,,,,,,,,,,,,,,,,,,,,,,,,,,,,,,,,,,,,,,,,,,,,,,,,,,,,,,,,,,,,,"""History,Commemorative Events,library,Repairs and restoration",,Archival,,1,0
12031,https://archive.carpentershall.org/items/show/12031,"Brief meeting agenda for the CCCCP Library Committee",,,,,1999-12-08,,"Library Committee Minutes",,,,,,,,,,"E. Fred Brecher",,,,,,,,,,,,,,,,,,,,,,,,,,,,,,,,,,,,,,,,,,,,,,,,,,,,,,,,,,,,,,,,,,,,,,,,681,5A,47,"Box # 173",,"Library Records",,,,,,,,,,,,,,,,,,,,,,,,,,,,,,,,,,,,,,,,,,,,,,,,,,,,,,,,,,,,,,,,,,,,,,,,,,,,,,,,,,,,,,,,,,,,,,,,"1999,library,library committee",,Archival,,1,0
12890,https://archive.carpentershall.org/items/show/12890,"Carpet Installation - Library",,,,,1973-05-30,,"Repairs / Restoration / Maintenance (Carpenters' Hall)",,,,,,,,,,"Thomas S. Keefer Preservation Program",,,,,,,,,,,,,,,,,,,,,,,,,,,,,,,,,,,,,,,,,,,,,,,,,,,,,,,,,,,,,,,,,,,,,,,,1540,7F,10,"Box #113",,Buildings,,,,,,,,,,,,,,,,,,,,,,,,,,,,,,,,,,,,,,,,,,,,,,,,,,,,,,,,,,,,,,,,,,,,,,,,,,,,,,,,,,,,,,,,,,,,,,,,library,,Archival,,1,0
13485,https://archive.carpentershall.org/items/show/13485,"Cellar Door Details by Stremme & Schweder",,,,,1981-04-18,,"Measured Drawings",,,,,,,,,,"Thomas S. Keefer Preservation Program",,,,,,,,,,,,,,,,,,,,,,,,,,,,,,,,,,,,,,,,,,,,,,,,,,,,,,,,,,,,,,,,,,,,,,,,2135,7C,4,"Box #133",,Buildings,,,,,,,,,,,,,,,,,,,,,,,,,,,,,,,,,,,,,,,,,,,,,,,,,,,,,,,,,,,,,,,,,,,,,,,,,,,,,,,,,,,,,,,,,,,,,,,,library,,Archival,,1,0
13560,https://archive.carpentershall.org/items/show/13560,"Clipping with photos: Independence Hall Becomes National Shrine",,,,,1977-12-12,,"National Park Service (NPS) - Relationship with CCCCP",,,,,,,,,,"Thomas S. Keefer 100/19",,,,,,,,,,,,,,,,,,,,,,,,,,,,,,,,,,,,,,,,,,,,,,,,,,,,,,,,,,,,,,,,,,,,,,,,2210,7H,9,"Oversized Box #1",,Buildings,,,,,,,,,,,,,,,,,,,,,,,,,,,,,,,,,,,,,,,,,,,,,,,,,,,,,,,,,,,,,,,,,,,,,,,,,,,,,,,,,,,,,,,,,,,,,,,,"library,Peterson",,Archival,,1,0
13903,https://archive.carpentershall.org/items/show/13903,"Copy of Text by Alphonse F. Trezza re: A History of the Library of the Carpenters' Company of the City and County of Philadelphia with Enclosed Correspondence",,,,,1981-12-17,,"Archival material relating to Library History",,,,,,,,,,"Leon Clemmer",,,,,,,,,,,,,,,,,,,,,,,,,,,,,,,,,,,,,,,,,,,,,,,,,,,,,,,,,,,,,,,,,,,,,,,,2553,5P,54,"Box #138",,"Library Records",,,,,,,,,,,,,,,,,,,,,,,,,,,,,,,,,,,,,,,,,,,,,,,,,,,,,,,,,,,,,,,,,,,,,,,,,,,,,,,,,,,,,,,,,,,,,,,,"History,library",,Archival,,1,0
12849,https://archive.carpentershall.org/items/show/12849,"Corres. re: Insurance on Collections & Library",,,,,1980-02-05,,"Insurance & Related Documents",,,,,,,,,,"""Thomas S. Keefer 100/26, 100/28, 99/14""",,,,,,,,,,,,,,,,,,,,,,,,,,,,,,,,,,,,,,,,,,,,,,,,,,,,,,,,,,,,,,,,,,,,,,,,1499,7E,21,"Box #112",,Buildings,,,,,,,,,,,,,,,,,,,,,,,,,,,,,,,,,,,,,,,,,,,,,,,,,,,,,,,,,,,,,,,,,,,,,,,,,,,,,,,,,,,,,,,,,,,,,,,,"""Insurance policies,Collections,Correspondence,library",,Archival,,1,0
12720,https://archive.carpentershall.org/items/show/12720,"Corres. re: publishing: 1. Simon - The Beginnings of Philadelphia 2. Proposal / Request for Funding - Bara 3. Peterson Report on Publications",,,,,1972-04-05,,"20th c. Publications",,,,,,,,,,"Thomas S. Keefer 99/2",,,,,,,,,,,,,,,,,,,,,,,,,,,,,,,,,,,,,,,,,,,,,,,,,,,,,,,,,,,,,,,,,,,,,,,,1370,5H,1,"Box #109",,"Library Records",,,,,,,,,,,,,,,,,,,,,,,,,,,,,,,,,,,,,,,,,,,,,,,,,,,,,,,,,,,,,,,,,,,,,,,,,,,,,,,,,,,,,,,,,,,,,,,,"""Committees,Correspondence,library,Publications""",,Archival,,1,0
12748,https://archive.carpentershall.org/items/show/12748,"Corres. with the Barra Foundation re: Funding for a CCCCP Monograph and possible purchase of the original Carpenters' Hall Deed",,,,,1977-05-31,,"20th c. Publications",,,,,,,,,,"Thomas S. Keefer 100/26",,,,,,,,,,,,,,,,,,,,,,,,,,,,,,,,,,,,,,,,,,,,,,,,,,,,,,,,,,,,,,,,,,,,,,,,1398,5H,7,"Box #110",,"Library Records",,,,,,,,,,,,,,,,,,,,,,,,,,,,,,,,,,,,,,,,,,,,,,,,,,,,,,,,,,,,,,,,,,,,,,,,,,,,,,,,,,,,,,,,,,,,,,,,"""Committees,Correspondence,library",,Archival,,1,0
12866,https://archive.carpentershall.org/items/show/12866,"Correspondence & Certificates of Insurance re: Coverage on the Collections & Rare Library Books During the Course of the Preservation Program (Includes List of Objects removed for storage, & storage details)",,,,,1980-03-14,,"Insurance & Related Documents",,,,,,,,,,"Thomas S. Keefer Preservation Program",,,,,,,,,,,,,,,,,,,,,,,,,,,,,,,,,,,,,,,,,,,,,,,,,,,,,,,,,,,,,,,,,,,,,,,,1516,7E,38,"Box #112",,Buildings,,,,,,,,,,,,,,,,,,,,,,,,,,,,,,,,,,,,,,,,,,,,,,,,,,,,,,,,,,,,,,,,,,,,,,,,,,,,,,,,,,,,,,,,,,,,,,,,"""Insurance,Collections,library,Restoration""",,Archival,,1,0
13895,https://archive.carpentershall.org/items/show/13895,"Correspondence re: Funding for Architectural Records",,,,,,,"Misc. Corres. related to Library",,,,,,,,,,"Leon Clemmer",,,,,,,,,,,,,,,,,,,,,,,,,,,,,,,,,,,,,,,,,,,,,,,,,,,,,,,,,,,,,,,,,,,,,,,,2545,5N,46,"Box #138",,"Library Records",,,,,,,,,,,,,,,,,,,,,,,,,,,,,,,,,,,,,,,,,,,,,,,,,,,,,,,,,,,,,,,,,,,,,,,,,,,,,,,,,,,,,,,,,,,,,,,,"Correspondence,library",,Archival,,1,0
13896,https://archive.carpentershall.org/items/show/13896,"Correspondence re: Larrry Coughlin's Interest in Carpenters' Hall",,,,,1975-05-09,,"Misc. Corres. related to Library",,,,,,,,,,"Leon Clemmer",,,,,,,,,,,,,,,,,,,,,,,,,,,,,,,,,,,,,,,,,,,,,,,,,,,,,,,,,,,,,,,,,,,,,,,,2546,5N,47,"Box #138",,"Library Records",,,,,,,,,,,,,,,,,,,,,,,,,,,,,,,,,,,,,,,,,,,,,,,,,,,,,,,,,,,,,,,,,,,,,,,,,,,,,,,,,,,,,,,,,,,,,,,,"Correspondence,library",,Archival,,1,0
13894,https://archive.carpentershall.org/items/show/13894,"Correspondence re: Microfilming the William Eyre Diaries",,,,,,,Archives,,,,,,,,,,"Leon Clemmer",,,,,,,,,,,,,,,,,,,,,,,,,,,,,,,,,,,,,,,,,,,,,,,,,,,,,,,,,,,,,,,,,,,,,,,,2544,5L,45,"Box #138",,"Library Records",,,,,,,,,,,,,,,,,,,,,,,,,,,,,,,,,,,,,,,,,,,,,,,,,,,,,,,,,,,,,,,,,,,,,,,,,,,,,,,,,,,,,,,,,,,,,,,,"History,library",,Archival,,1,0
13888,https://archive.carpentershall.org/items/show/13888,"Correspondence re: Publications of the Carpenters' Company",,,,,1981-03-27,,"20th Century Publications",,,,,,,,,,"Leon Clemmer",,,,,,,,,,,,,,,,,,,,,,,,,,,,,,,,,,,,,,,,,,,,,,,,,,,,,,,,,,,,,,,,,,,,,,,,2538,5H,39,"Box #138",,"Library Records",,,,,,,,,,,,,,,,,,,,,,,,,,,,,,,,,,,,,,,,,,,,,,,,,,,,,,,,,,,,,,,,,,,,,,,,,,,,,,,,,,,,,,,,,,,,,,,,"library,Publications",,Archival,,1,0
13886,https://archive.carpentershall.org/items/show/13886,"Correspondence re: Review and Recommendations for the Carpenters' Company Library",,,,,,,"Library Committee Business & Correspondence",,,,,,,,,,"Leon Clemmer",,,,,,,,,,,,,,,,,,,,,,,,,,,,,,,,,,,,,,,,,,,,,,,,,,,,,,,,,,,,,,,,,,,,,,,,2536,5F,37,"Box #138",,"Library Records",,,,,,,,,,,,,,,,,,,,,,,,,,,,,,,,,,,,,,,,,,,,,,,,,,,,,,,,,,,,,,,,,,,,,,,,,,,,,,,,,,,,,,,,,,,,,,,,library,,Archival,,1,0
13898,https://archive.carpentershall.org/items/show/13898,"Correspondence re: The Library's Role in the Carpenter's Company",,,,,,,"Misc. Corres. related to Library",,,,,,,,,,"Leon Clemmer",,,,,,,,,,,,,,,,,,,,,,,,,,,,,,,,,,,,,,,,,,,,,,,,,,,,,,,,,,,,,,,,,,,,,,,,2548,5N,49,"Box #138",,"Library Records",,,,,,,,,,,,,,,,,,,,,,,,,,,,,,,,,,,,,,,,,,,,,,,,,,,,,,,,,,,,,,,,,,,,,,,,,,,,,,,,,,,,,,,,,,,,,,,,"Correspondence,library",,Archival,,1,0
13899,https://archive.carpentershall.org/items/show/13899,"Correspondence re: the Release of Boks from the Company Library",,,,,,,"Misc. Corres. related to Library",,,,,,,,,,"Leon Clemmer",,,,,,,,,,,,,,,,,,,,,,,,,,,,,,,,,,,,,,,,,,,,,,,,,,,,,,,,,,,,,,,,,,,,,,,,2549,5N,50,"Box #138",,"Library Records",,,,,,,,,,,,,,,,,,,,,,,,,,,,,,,,,,,,,,,,,,,,,,,,,,,,,,,,,,,,,,,,,,,,,,,,,,,,,,,,,,,,,,,,,,,,,,,,"Correspondence,library",,Archival,,1,0
13897,https://archive.carpentershall.org/items/show/13897,"Correspondence re:Company Publications",,,,,,,"Misc. Corres. related to Library",,,,,,,,,,"Leon Clemmer",,,,,,,,,,,,,,,,,,,,,,,,,,,,,,,,,,,,,,,,,,,,,,,,,,,,,,,,,,,,,,,,,,,,,,,,2547,5N,48,"Box #138",,"Library Records",,,,,,,,,,,,,,,,,,,,,,,,,,,,,,,,,,,,,,,,,,,,,,,,,,,,,,,,,,,,,,,,,,,,,,,,,,,,,,,,,,,,,,,,,,,,,,,,"Correspondence,library,Publications",,Archival,,1,0
12721,https://archive.carpentershall.org/items/show/12721,"Correspondence with London Company re: Publication of London Co. Wardens' Records",,,,,1969-04-10,,"20th c. Publications",,,,,,,,,,"Thomas S. Keefer 99/2",,,,,,,,,,,,,,,,,,,,,,,,,,,,,,,,,,,,,,,,,,,,,,,,,,,,,,,,,,,,,,,,,,,,,,,,1371,5H,2,"Box #109",,"Library Records",,,,,,,,,,,,,,,,,,,,,,,,,,,,,,,,,,,,,,,,,,,,,,,,,,,,,,,,,,,,,,,,,,,,,,,,,,,,,,,,,,,,,,,,,,,,,,,,"""Committees,Correspondence,library",,Archival,,1,0
14685,https://archive.carpentershall.org/items/show/14685,"Correspondence- Re: desire of CC to retain all Library books",,,,,1979-06-01,,"Misc. Corres. related to Library",,,,,,,,,,"Leon Clemmer",,,,,,,,,,,,,,,,,,,,,,,,,,,,,,,,,,,,,,,,,,,,,,,,,,,,,,,,,,,,,,,,,,,,,,,,3088,5N,19,"Box 151",,"Library Records",,,,,,,,,,,,,,,,,,,,,,,,,,,,,,,,,,,,,,,,,,,,,,,,,,,,,,,,,,,,,,,,,,,,,,,,,,,,,,,,,,,,,,,,,,,,,,,,"American Philosophical Society Library,library,library committee,Long Range Planning Committee",,Archival,,1,0
14687,https://archive.carpentershall.org/items/show/14687,"Correspondence- Re: desire of CC to retain all Library books",,,,,1979-06-01,,"Misc. Corres. related to Library",,,,,,,,,,"Leon Clemmer",,,,,,,,,,,,,,,,,,,,,,,,,,,,,,,,,,,,,,,,,,,,,,,,,,,,,,,,,,,,,,,,,,,,,,,,3089,5N,19,"Box 151",,"Library Records",,,,,,,,,,,,,,,,,,,,,,,,,,,,,,,,,,,,,,,,,,,,,,,,,,,,,,,,,,,,,,,,,,,,,,,,,,,,,,,,,,,,,,,,,,,,,,,,"American Philosophical Society Library,library,library committee,Long Range Planning Committee",,Archival,,1,0
14677,https://archive.carpentershall.org/items/show/14677,"Correspondence- Re: Unavailability of Library for research due to condition of unrestored books",,,,,1/11/1980,,"Library Borrowers, Researchers & Inquires",,,,,,,,,,"Leon Clemmer",,,,,,,,,,,,,,,,,,,,,,,,,,,,,,,,,,,,,,,,,,,,,,,,,,,,,,,,,,,,,,,,,,,,,,,,3085,5D,16,"Box 151",,"Library Records",,,,,,,,,,,,,,,,,,,,,,,,,,,,,,,,,,,,,,,,,,,,,,,,,,,,,,,,,,,,,,,,,,,,,,,,,,,,,,,,,,,,,,,,,,,,,,,,"library,library committee,managing committee",,Archival,,1,0
12956,https://archive.carpentershall.org/items/show/12956,"Cost Analysis - Revised",,,,,1981-05-12,,"Repairs / Restoration / Maintenance (Carpenters' Hall)",,,,,,,,,,"Thomas S. Keefer Preservation Program",,,,,,,,,,,,,,,,,,,,,,,,,,,,,,,,,,,,,,,,,,,,,,,,,,,,,,,,,,,,,,,,,,,,,,,,1606,7F,14,"Box #117",,Buildings,,,,,,,,,,,,,,,,,,,,,,,,,,,,,,,,,,,,,,,,,,,,,,,,,,,,,,,,,,,,,,,,,,,,,,,,,,,,,,,,,,,,,,,,,,,,,,,,library,,Archival,,1,0
11683,https://archive.carpentershall.org/items/show/11683,"Cover letter for a missing Treasurer's Report from John W. Cornell, concerning the CCCCP/A.I.A. book",,,,,1958-09-30,,"20th Century Publications",,,,,,,,,,"H. Mather Lippincott",,,,,,,,,,,,,,,,,,,,,,,,,,,,,,,,,,,,,,,,,,,,,,,,,,,,,,,,,,,,,,,,,,,,,,,,333,5H,59,"Box # 172",,"Library Records",,,,,,,,,,,,,,,,,,,,,,,,,,,,,,,,,,,,,,,,,,,,,,,,,,,,,,,,,,,,,,,,,,,,,,,,,,,,,,,,,,,,,,,,,,,,,,,,"1958,letter,library",,Archival,,1,0
11655,https://archive.carpentershall.org/items/show/11655,"Cover letter from Alan B. Kirschbaum with one following ""Annual Blanket Exemption Certificate to be Used by Vendors when Purchasing Property for the Purpose of Resale""",,,,,1958-01-06,,"20th Century Publications",,,,,,,,,,"H. Mather Lippincott",,,,,,,,,,,,,,,,,,,,,,,,,,,,,,,,,,,,,,,,,,,,,,,,,,,,,,,,,,,,,,,,,,,,,,,,305,5H,40,"Box # 172",,"Library Records",,,,,,,,,,,,,,,,,,,,,,,,,,,,,,,,,,,,,,,,,,,,,,,,,,,,,,,,,,,,,,,,,,,,,,,,,,,,,,,,,,,,,,,,,,,,,,,,"1958,library",,Archival,,1,0