﻿"Item Id","Item URI","Dublin Core:Title","Dublin Core:Identifier","Dublin Core:Is Referenced By","Dublin Core:Alternative Title","Dublin Core:Creator","Dublin Core:Date","Dublin Core:Description","Dublin Core:Subject","Dublin Core:Spatial Coverage","Dublin Core:Extent","Dublin Core:Medium","Dublin Core:Format","Dublin Core:Rights","Dublin Core:Language","Dublin Core:Type","Dublin Core:Has Format","Dublin Core:Has Version","Dublin Core:Source","Dublin Core:Publisher","Dublin Core:Contributor","Dublin Core:Relation","Dublin Core:Coverage","Dublin Core:Abstract","Dublin Core:Table Of Contents","Dublin Core:Date Available","Dublin Core:Date Created","Dublin Core:Date Accepted","Dublin Core:Date Copyrighted","Dublin Core:Date Submitted","Dublin Core:Date Issued","Dublin Core:Date Modified","Dublin Core:Date Valid","Dublin Core:Access Rights","Dublin Core:License","Dublin Core:Conforms To","Dublin Core:Has Part","Dublin Core:Is Format Of","Dublin Core:Is Part Of","Dublin Core:Is Replaced By","Dublin Core:Is Required By","Dublin Core:Is Version Of","Dublin Core:References","Dublin Core:Replaces","Dublin Core:Requires","Dublin Core:Bibliographic Citation","Dublin Core:Temporal Coverage","Dublin Core:Accrual Method","Dublin Core:Accrual Periodicity","Dublin Core:Accrual Policy","Dublin Core:Audience","Dublin Core:Audience Education Level","Dublin Core:Mediator","Dublin Core:Instructional Method","Dublin Core:Provenance","Dublin Core:Rights Holder","Item Type Metadata:Text","Item Type Metadata:Interviewer","Item Type Metadata:Interviewee","Item Type Metadata:Location","Item Type Metadata:Transcription","Item Type Metadata:Local URL","Item Type Metadata:Original Format","Item Type Metadata:Physical Dimensions","Item Type Metadata:Duration","Item Type Metadata:Compression","Item Type Metadata:Producer","Item Type Metadata:Director","Item Type Metadata:Bit Rate/Frequency","Item Type Metadata:Time Summary","Item Type Metadata:Email Body","Item Type Metadata:Subject Line","Item Type Metadata:From","Item Type Metadata:To","Item Type Metadata:CC","Item Type Metadata:BCC","Item Type Metadata:Number of Attachments","Item Type Metadata:Standards","Item Type Metadata:Objectives","Item Type Metadata:Materials","Item Type Metadata:Lesson Plan Text","Item Type Metadata:URL","Item Type Metadata:Event Type","Item Type Metadata:Participants","Item Type Metadata:Birth Date","Item Type Metadata:Birthplace","Item Type Metadata:Death Date","Item Type Metadata:Occupation","Item Type Metadata:Biographical Text","Item Type Metadata:Bibliography","Item Type Metadata:Legacy Record Number","Item Type Metadata:Series Code","Item Type Metadata:File Number","Item Type Metadata:Shelf Location","Item Type Metadata:Microfilm","Item Type Metadata:Series","Item Type Metadata:1827 Catalog","Item Type Metadata:1840 Catalog","Item Type Metadata:1857 Catalog","Item Type Metadata:1857 Inventory","Item Type Metadata:1894 Catalog","Item Type Metadata:1894 Inventory","Item Type Metadata:Accession Number","Item Type Metadata:Binding Condition","Item Type Metadata:Binding","Item Type Metadata:Condition","Item Type Metadata:Conservation Assessment","Item Type Metadata:Conservation Comment","Item Type Metadata:Conservation Source","Item Type Metadata:Conservation","Item Type Metadata:Copy","Item Type Metadata:Cover","Item Type Metadata:Enclosure Condition","Item Type Metadata:Enclosure Type","Item Type Metadata:Housing","Item Type Metadata:Inclusions","Item Type Metadata:Inscriptions","Item Type Metadata:Publisher Location","Item Type Metadata:Paper","Item Type Metadata:Post 1894 Catalog / Inventory","Item Type Metadata:Treatment","Item Type Metadata:Value","Item Type Metadata:Volume","Item Type Metadata:Cataloged By","Item Type Metadata:History","Item Type Metadata:Markings","Item Type Metadata:Negative Number","Item Type Metadata:Measurements","Item Type Metadata:Photo Roll Number","Item Type Metadata:Present Location","Item Type Metadata:Reference","Item Type Metadata:See Also","Item Type Metadata:Where Made","Item Type Metadata:Date Cataloged","Item Type Metadata:AIA Photo Number","Item Type Metadata:Inventory","Item Type Metadata:Slide Number","Item Type Metadata:Additional Data","Item Type Metadata:Affiliated Members of Company","Item Type Metadata:Application Date","Item Type Metadata:Office Held","Item Type Metadata:Committee Membership","Item Type Metadata:Brochures, etc.","Item Type Metadata:Business Name","Item Type Metadata:Children","Item Type Metadata:Where Born","Item Type Metadata:Civic Activities","Item Type Metadata:Deceased Date","Item Type Metadata:Descendant","Item Type Metadata:Education","Item Type Metadata:Date Elected","Item Type Metadata:Date Expelled","Item Type Metadata:Father","Item Type Metadata:First Name","Item Type Metadata:Last Name","Item Type Metadata:Listings","Item Type Metadata:Married","Item Type Metadata:Member Number","Item Type Metadata:Middle Name","Item Type Metadata:Military","Item Type Metadata:Mother","Item Type Metadata:Nominator","Item Type Metadata:Nonprofit Directorships","Item Type Metadata:Notes","Item Type Metadata:Other Affiliations","Item Type Metadata:Personal Background","Item Type Metadata:Professional Activities","Item Type Metadata:Project","Item Type Metadata:Date Resigned","Item Type Metadata:Revolutionary War","Item Type Metadata:Seconder","Item Type Metadata:Spouse Born","Item Type Metadata:Spouse Name","Item Type Metadata:Name Suffix","Item Type Metadata:Clubs","Item Type Metadata:Senior Status","Item Type Metadata:Video Interview","Item Type Metadata:Grantor Records Notes","Item Type Metadata:Deed Granted to","Item Type Metadata:Defendant/Sheriff's Sale Notes","Item Type Metadata:Defendant/Sheriff's Sale to","Item Type Metadata:Descendant Address","Item Type Metadata:Business Address","Item Type Metadata:Home Address","Item Type Metadata:Telephone","Item Type Metadata:Member in 1775","Item Type Metadata:No Signature","Item Type Metadata:APS Item Number","Item Type Metadata:Box","Item Type Metadata:Item Location","Item Type Metadata:Transcription Source",tags,file,itemType,collection,public,featured
13900,https://archive.carpentershall.org/items/show/13900,"Notes re: Some Books in the Carpenters' Hall Library",,,,,"date unknown",,"Misc. Corres. related to Library",,,,,,,,,,"Leon Clemmer",,,,,,,,,,,,,,,,,,,,,,,,,,,,,,,,,,,,,,,,,,,,,,,,,,,,,,,,,,,,,,,,,,,,,,,,2550,5N,51,"Box #138",,"Library Records",,,,,,,,,,,,,,,,,,,,,,,,,,,,,,,,,,,,,,,,,,,,,,,,,,,,,,,,,,,,,,,,,,,,,,,,,,,,,,,,,,,,,,,,,,,,,,,,"Correspondence,library",,Archival,,1,0
11656,https://archive.carpentershall.org/items/show/11656,"Monthly statement from Edward Stern and Company with included list of costs for copies of the CCCCP/A.I.A. book",,,,,1957-12-27,,"20th Century Publications",,,,,,,,,,"H. Mather Lippincott",,,,,,,,,,,,,,,,,,,,,,,,,,,,,,,,,,,,,,,,,,,,,,,,,,,,,,,,,,,,,,,,,,,,,,,,306,5H,41,"Box # 172",,"Library Records",,,,,,,,,,,,,,,,,,,,,,,,,,,,,,,,,,,,,,,,,,,,,,,,,,,,,,,,,,,,,,,,,,,,,,,,,,,,,,,,,,,,,,,,,,,,,,,,"1957,library",,Archival,,1,0
13889,https://archive.carpentershall.org/items/show/13889,"Miscellany re: Appraisals of Carpenters' Company Library Books",,,,,1986-12-08,,"Appraisals & Condition Surveys",,,,,,,,,,"Leon Clemmer",,,,,,,,,,,,,,,,,,,,,,,,,,,,,,,,,,,,,,,,,,,,,,,,,,,,,,,,,,,,,,,,,,,,,,,,2539,5I,40,"Box #138",,"Library Records",,,,,,,,,,,,,,,,,,,,,,,,,,,,,,,,,,,,,,,,,,,,,,,,,,,,,,,,,,,,,,,,,,,,,,,,,,,,,,,,,,,,,,,,,,,,,,,,"library,Repairs and restoration",,Archival,,1,0
13100,https://archive.carpentershall.org/items/show/13100,"Misc. Library Acquisitions (filed in the Archives) from John F. Harbeson (Early Phila. Architects; The Genesis of the White House; How Independence Hall was Built.)",,,,,,,"Library Acquisitions",,,,,,,,,,"Thomas S. Keefer 99/2",,,,,,,,,,,,,,,,,,,,,,,,,,,,,,,,,,,,,,,,,,,,,,,,,,,,,,,,,,,,,,,,,,,,,,,,1750,5K,36,"Box #120",,"Library Records",,,,,,,,,,,,,,,,,,,,,,,,,,,,,,,,,,,,,,,,,,,,,,,,,,,,,,,,,,,,,,,,,,,,,,,,,,,,,,,,,,,,,,,,,,,,,,,,library,,Archival,,1,0
12712,https://archive.carpentershall.org/items/show/12712,"Misc. Correspondence To or From T. Keefer Directly (re: Library Committee)",,,,,1971-10-21,,"Library Committee Business & Correspondence",,,,,,,,,,"Thomas S. Keefer 99/2 & 99/4",,,,,,,,,,,,,,,,,,,,,,,,,,,,,,,,,,,,,,,,,,,,,,,,,,,,,,,,,,,,,,,,,,,,,,,,1362,5F,43,"Box #108",,"Library Records",,,,,,,,,,,,,,,,,,,,,,,,,,,,,,,,,,,,,,,,,,,,,,,,,,,,,,,,,,,,,,,,,,,,,,,,,,,,,,,,,,,,,,,,,,,,,,,,"""Committees,Correspondence,library",,Archival,,1,0
12707,https://archive.carpentershall.org/items/show/12707,"Misc. Correspondence re: Whereabouts of the Books (Loaned/Acquired, etc.)",,,,,1967-09-26,,"Library Committee Business & Correspondence",,,,,,,,,,"Thomas S. Keefer 99/2",,,,,,,,,,,,,,,,,,,,,,,,,,,,,,,,,,,,,,,,,,,,,,,,,,,,,,,,,,,,,,,,,,,,,,,,1357,5F,38,"Box #108",,"Library Records",,,,,,,,,,,,,,,,,,,,,,,,,,,,,,,,,,,,,,,,,,,,,,,,,,,,,,,,,,,,,,,,,,,,,,,,,,,,,,,,,,,,,,,,,,,,,,,,"""Committees,Correspondence,library",,Archival,,1,0
12733,https://archive.carpentershall.org/items/show/12733,"Misc. Correspondence re: 20th c. Publications ( includes snippets of CCCCP history by Charlie Peterson)",,,,,1973-03-09,,"20th c. Publications",,,,,,,,,,"Thomas S. Keefer 100/15",,,,,,,,,,,,,,,,,,,,,,,,,,,,,,,,,,,,,,,,,,,,,,,,,,,,,,,,,,,,,,,,,,,,,,,,1383,5H,14,"Box #109",,"Library Records",,,,,,,,,,,,,,,,,,,,,,,,,,,,,,,,,,,,,,,,,,,,,,,,,,,,,,,,,,,,,,,,,,,,,,,,,,,,,,,,,,,,,,,,,,,,,,,,"""Committees,Correspondence,History"",library",,Archival,,1,0
12710,https://archive.carpentershall.org/items/show/12710,"Misc. Correspondence on which T. Keefer was copied (re: Library Committee) (Much by J. Harbeson & C. Peterson)",,,,,1973-03-12,,"Library Committee Business & Correspondence",,,,,,,,,,"Thomas S. Keefer 99/2",,,,,,,,,,,,,,,,,,,,,,,,,,,,,,,,,,,,,,,,,,,,,,,,,,,,,,,,,,,,,,,,,,,,,,,,1360,5F,41,"Box #108",,"Library Records",,,,,,,,,,,,,,,,,,,,,,,,,,,,,,,,,,,,,,,,,,,,,,,,,,,,,,,,,,,,,,,,,,,,,,,,,,,,,,,,,,,,,,,,,,,,,,,,"""Committees,Correspondence,library",,Archival,,1,0
12732,https://archive.carpentershall.org/items/show/12732,"Misc. Charlie Peterson Correspondence & Research for Publication",,,,,1973-03-26,,"20th c. Publications",,,,,,,,,,"Thomas S. Keefer 100/15",,,,,,,,,,,,,,,,,,,,,,,,,,,,,,,,,,,,,,,,,,,,,,,,,,,,,,,,,,,,,,,,,,,,,,,,1382,5H,13,"Box #109",,"Library Records",,,,,,,,,,,,,,,,,,,,,,,,,,,,,,,,,,,,,,,,,,,,,,,,,,,,,,,,,,,,,,,,,,,,,,,,,,,,,,,,,,,,,,,,,,,,,,,,"""Committees,Correspondence,History"",library",,Archival,,1,0
12729,https://archive.carpentershall.org/items/show/12729,"Misc. Charlie Peterson Correspondence (Originally found with materials about 20th c. Publications)",,,,,1974-04-05,,"20th c. Publications",,,,,,,,,,"Thomas S. Keefer 100/14",,,,,,,,,,,,,,,,,,,,,,,,,,,,,,,,,,,,,,,,,,,,,,,,,,,,,,,,,,,,,,,,,,,,,,,,1379,5H,10,"Box #109",,"Library Records",,,,,,,,,,,,,,,,,,,,,,,,,,,,,,,,,,,,,,,,,,,,,,,,,,,,,,,,,,,,,,,,,,,,,,,,,,,,,,,,,,,,,,,,,,,,,,,,"""Committees,Correspondence,library",,Archival,,1,0
12034,https://archive.carpentershall.org/items/show/12034,"Minutes of the Library Committee Meeting of September 22, 1999 by R. Thomas Unkefer",,,,,1999-09-22,,"Library Committee Minutes",,,,,,,,,,"E. Fred Brecher",,,,,,,,,,,,,,,,,,,,,,,,,,,,,,,,,,,,,,,,,,,,,,,,,,,,,,,,,,,,,,,,,,,,,,,,684,5A,47,"Box # 173",,"Library Records",,,,,,,,,,,,,,,,,,,,,,,,,,,,,,,,,,,,,,,,,,,,,,,,,,,,,,,,,,,,,,,,,,,,,,,,,,,,,,,,,,,,,,,,,,,,,,,,"1999,library,library committee",,Archival,,1,0
12032,https://archive.carpentershall.org/items/show/12032,"Minutes from the October 14, 1998 Library Committee Meeting by Thomas Unkefer",,,,,1998-10-14,,"Library Committee Minutes",,,,,,,,,,"E. Fred Brecher",,,,,,,,,,,,,,,,,,,,,,,,,,,,,,,,,,,,,,,,,,,,,,,,,,,,,,,,,,,,,,,,,,,,,,,,682,5A,47,"Box # 173",,"Library Records",,,,,,,,,,,,,,,,,,,,,,,,,,,,,,,,,,,,,,,,,,,,,,,,,,,,,,,,,,,,,,,,,,,,,,,,,,,,,,,,,,,,,,,,,,,,,,,,"1998,library,library committee",,Archival,,1,0
12749,https://archive.carpentershall.org/items/show/12749,"Meeting Place of History booklet - semi-final draft with cover letter soliciting comments",,,,,,,"20th c. Publications",,,,,,,,,,"Thomas S. Keefer 100/29",,,,,,,,,,,,,,,,,,,,,,,,,,,,,,,,,,,,,,,,,,,,,,,,,,,,,,,,,,,,,,,,,,,,,,,,1399,5H,8,"Box #110",,"Library Records",,,,,,,,,,,,,,,,,,,,,,,,,,,,,,,,,,,,,,,,,,,,,,,,,,,,,,,,,,,,,,,,,,,,,,,,,,,,,,,,,,,,,,,,,,,,,,,,"""Committees,Correspondence,library",,Archival,,1,0
12957,https://archive.carpentershall.org/items/show/12957,"Library: Work on the Rare Book Vault during the Keefer Restoration",,,,,1981-06-17,,"Repairs / Restoration / Maintenance (Carpenters' Hall)",,,,,,,,,,"Thomas S. Keefer Preservation Program",,,,,,,,,,,,,,,,,,,,,,,,,,,,,,,,,,,,,,,,,,,,,,,,,,,,,,,,,,,,,,,,,,,,,,,,1607,7F,15,"Box #117",,Buildings,,,,,,,,,,,,,,,,,,,,,,,,,,,,,,,,,,,,,,,,,,,,,,,,,,,,,,,,,,,,,,,,,,,,,,,,,,,,,,,,,,,,,,,,,,,,,,,,library,,Archival,,1,0
15620,https://archive.carpentershall.org/items/show/15620,"Library Committee Regarding Publication of ""The Annals of Carpenters' Hall""",,,,,,,"Library Committe Business & Correspondence",,,,,,,,,,"Charles Kessler",,,,,,,,,,,,,,,,,,,,,,,,,,,,,,,,,,,,,,,,,,,,,,,,,,,,,,,,,,,,,,,,,,,,,,,,3572,5F,23,"Box #162",,"Library Records",,,,,,,,,,,,,,,,,,,,,,,,,,,,,,,,,,,,,,,,,,,,,,,,,,,,,,,,,,,,,,,,,,,,,,,,,,,,,,,,,,,,,,,,,,,,,,,,"""Committee,library,Publications""",,Archival,,1,0
12704,https://archive.carpentershall.org/items/show/12704,"Library Committee Recommendations for 250th Anniversary",,,,,,,"Library Committee Reports",,,,,,,,,,,,,,,,,,,,,,,,,,,,,,,,,,,,,,,,,,,,,,,,,,,,,,,,,,,,,,,,,,,,,,,,,,,,,,,,,,1354,5E,35,"Box #108",,"Library Records",,,,,,,,,,,,,,,,,,,,,,,,,,,,,,,,,,,,,,,,,,,,,,,,,,,,,,,,,,,,,,,,,,,,,,,,,,,,,,,,,,,,,,,,,,,,,,,,"""Committees,250th Anniversary,Correspondence,Exhibits"",library",,Archival,,1,0
12042,https://archive.carpentershall.org/items/show/12042,"Library Committee Minutes of the December 8, 1999 Meeting",,,,,1999-12-08,,"Library Committee Business & Correspondence",,,,,,,,,,"E. Fred Brecher",,,,,,,,,,,,,,,,,,,,,,,,,,,,,,,,,,,,,,,,,,,,,,,,,,,,,,,,,,,,,,,,,,,,,,,,692,5F,49,"Box # 173",,"Library Records",,,,,,,,,,,,,,,,,,,,,,,,,,,,,,,,,,,,,,,,,,,,,,,,,,,,,,,,,,,,,,,,,,,,,,,,,,,,,,,,,,,,,,,,,,,,,,,,"1999,library,library committee",,Archival,,1,0
13808,https://archive.carpentershall.org/items/show/13808,"LIbrary Committee Members 1858-1873",,,,,,,Elections/Officers,,,,,,,,,,"Leon Clemmer",,,,,,,,,,,,,,,,,,,,,,,,,,,,,,,,,,,,,,,,,,,,,,,,,,,,,,,,,,,,,,,,,,,,,,,,2458,1C,18,"Box 137",,"Company Minutes",,,,,,,,,,,,,,,,,,,,,,,,,,,,,,,,,,,,,,,,,,,,,,,,,,,,,,,,,,,,,,,,,,,,,,,,,,,,,,,,,,,,,,,,,,,,,,,,library,,Archival,,1,0
12039,https://archive.carpentershall.org/items/show/12039,"Library Committee Agenda for August 6, 1998",,,,,1998-08-06,,"Library Committee Business & Correspondence",,,,,,,,,,"E. Fred Brecher",,,,,,,,,,,,,,,,,,,,,,,,,,,,,,,,,,,,,,,,,,,,,,,,,,,,,,,,,,,,,,,,,,,,,,,,689,5F,48,"Box # 173",,"Library Records",,,,,,,,,,,,,,,,,,,,,,,,,,,,,,,,,,,,,,,,,,,,,,,,,,,,,,,,,,,,,,,,,,,,,,,,,,,,,,,,,,,,,,,,,,,,,,,,"1998,library,library committee",,Archival,,1,0
12754,https://archive.carpentershall.org/items/show/12754,"Library Collections: condition of the Materials",,,,,1967-07-05,,"Appraisals & Condition Surveys",,,,,,,,,,"Thomas S. Keefer 99/2",,,,,,,,,,,,,,,,,,,,,,,,,,,,,,,,,,,,,,,,,,,,,,,,,,,,,,,,,,,,,,,,,,,,,,,,1404,5I,13,"Box #110",,"Library Records",,,,,,,,,,,,,,,,,,,,,,,,,,,,,,,,,,,,,,,,,,,,,,,,,,,,,,,,,,,,,,,,,,,,,,,,,,,,,,,,,,,,,,,,,,,,,,,,library,,Archival,,1,0
13885,https://archive.carpentershall.org/items/show/13885,"Library Catalog",,,,,"date unknown",,"Library Catalogs",,,,,,,,,,"Leon Clemmer",,,,,,,,,,,,,,,,,,,,,,,,,,,,,,,,,,,,,,,,,,,,,,,,,,,,,,,,,,,,,,,,,,,,,,,,2535,5B,36,"Box #138",,"Library Records",,,,,,,,,,,,,,,,,,,,,,,,,,,,,,,,,,,,,,,,,,,,,,,,,,,,,,,,,,,,,,,,,,,,,,,,,,,,,,,,,,,,,,,,,,,,,,,,library,,Archival,,1,0
12753,https://archive.carpentershall.org/items/show/12753,"Library Appraisals & Insurance Issues",,,,,1968-09-12,,"Appraisals & Condition Surveys",,,,,,,,,,"Thomas S. Keefer 99/2",,,,,,,,,,,,,,,,,,,,,,,,,,,,,,,,,,,,,,,,,,,,,,,,,,,,,,,,,,,,,,,,,,,,,,,,1403,5I,12,"Box #110",,"Library Records",,,,,,,,,,,,,,,,,,,,,,,,,,,,,,,,,,,,,,,,,,,,,,,,,,,,,,,,,,,,,,,,,,,,,,,,,,,,,,,,,,,,,,,,,,,,,,,,library,,Archival,,1,0
12755,https://archive.carpentershall.org/items/show/12755,"Library Appraisal by A. Richard Flora",,,,,1979-10-26,,"Appraisals & Condition Surveys",,,,,,,,,,"Thomas S. Keefer 100/26",,,,,,,,,,,,,,,,,,,,,,,,,,,,,,,,,,,,,,,,,,,,,,,,,,,,,,,,,,,,,,,,,,,,,,,,1405,5I,14,"Box #110",,"Library Records",,,,,,,,,,,,,,,,,,,,,,,,,,,,,,,,,,,,,,,,,,,,,,,,,,,,,,,,,,,,,,,,,,,,,,,,,,,,,,,,,,,,,,,,,,,,,,,,library,,Archival,,1,0
12756,https://archive.carpentershall.org/items/show/12756,"Library Appraisal (& related corres.) by Gordon Hillis & Samuel T. Freeman & Co.",,,,,1979-10-26,,"Appraisals & Condition Surveys",,,,,,,,,,"Thomas S. Keefer 100/28",,,,,,,,,,,,,,,,,,,,,,,,,,,,,,,,,,,,,,,,,,,,,,,,,,,,,,,,,,,,,,,,,,,,,,,,1406,5I,15,"Box #110",,"Library Records",,,,,,,,,,,,,,,,,,,,,,,,,,,,,,,,,,,,,,,,,,,,,,,,,,,,,,,,,,,,,,,,,,,,,,,,,,,,,,,,,,,,,,,,,,,,,,,,library,,Archival,,1,0
13189,https://archive.carpentershall.org/items/show/13189,"Library - order to re-cover the Director's Table",,,,,,,"Care / Restoration",,,,,,,,,,"Thomas S. Keefer 100/13",,,,,,,,,,,,,,,,,,,,,,,,,,,,,,,,,,,,,,,,,,,,,,,,,,,,,,,,,,,,,,,,,,,,,,,,1839,10H,46,"Box #121",,Collections,,,,,,,,,,,,,,,,,,,,,,,,,,,,,,,,,,,,,,,,,,,,,,,,,,,,,,,,,,,,,,,,,,,,,,,,,,,,,,,,,,,,,,,,,,,,,,,,library,,Archival,,1,0
12043,https://archive.carpentershall.org/items/show/12043,"Letter with the agenda for and announcement of an upcoming Library Committee Meeting on March 22, 2000",,,,,2000-03-14,,"Library Committee Business & Correspondence",,,,,,,,,,"E. Fred Brecher",,,,,,,,,,,,,,,,,,,,,,,,,,,,,,,,,,,,,,,,,,,,,,,,,,,,,,,,,,,,,,,,,,,,,,,,693,5F,50,"Box # 173",,"Library Records",,,,,,,,,,,,,,,,,,,,,,,,,,,,,,,,,,,,,,,,,,,,,,,,,,,,,,,,,,,,,,,,,,,,,,,,,,,,,,,,,,,,,,,,,,,,,,,,"2000,letter,library,library committee",,Archival,,1,0
12047,https://archive.carpentershall.org/items/show/12047,"Letter to the membership from John K. Ball announcing that E. Clifford Durell, Jr.'s wife will match any amount of money donated to the Library Fund in honor of her husband",,,,,1998-11-24,,"Library Committee Business & Correspondence",,,,,,,,,,"E. Fred Brecher",,,,,,,,,,,,,,,,,,,,,,,,,,,,,,,,,,,,,,,,,,,,,,,,,,,,,,,,,,,,,,,,,,,,,,,,697,5F,48,"Box # 173",,"Library Records",,,,,,,,,,,,,,,,,,,,,,,,,,,,,,,,,,,,,,,,,,,,,,,,,,,,,,,,,,,,,,,,,,,,,,,,,,,,,,,,,,,,,,,,,,,,,,,,"1998,death,letter,library,library committee",,Archival,,1,0
11640,https://archive.carpentershall.org/items/show/11640,"Letter on Frank G. English & Sons stationary listing the Treasurer's Account of the CCCCP Book Fund for 1957 and 1958",,,,,1958-09-04,,"20th Century Publications",,,,,,,,,,"H. Mather Lippincott",,,,,,,,,,,,,,,,,,,,,,,,,,,,,,,,,,,,,,,,,,,,,,,,,,,,,,,,,,,,,,,,,,,,,,,,290,5H,25,"Box # 172",,"Library Records",,,,,,,,,,,,,,,,,,,,,,,,,,,,,,,,,,,,,,,,,,,,,,,,,,,,,,,,,,,,,,,,,,,,,,,,,,,,,,,,,,,,,,,,,,,,,,,,"1957,1958,letter,library",,Archival,,1,0
11621,https://archive.carpentershall.org/items/show/11621,"Letter from Thomas Keefer concerning an upcoming ""Library Night""",,,,,1977-02-25,,"Library Committee Business and Correspondence",,,,,,,,,,"H. Mather Lippincott",,,,,,,,,,,,,,,,,,,,,,,,,,,,,,,,,,,,,,,,,,,,,,,,,,,,,,,,,,,,,,,,,,,,,,,,271,5F,6,"Box # 172",,"Library Records",,,,,,,,,,,,,,,,,,,,,,,,,,,,,,,,,,,,,,,,,,,,,,,,,,,,,,,,,,,,,,,,,,,,,,,,,,,,,,,,,,,,,,,,,,,,,,,,"1977,letter,library",,Archival,,1,0
11692,https://archive.carpentershall.org/items/show/11692,"Letter from Richard P. Moses regarding the CCCCP/A.I.A. book",,,,,1957-11-06,,"20th Century Publications",,,,,,,,,,"H. Mather Lippincott",,,,,,,,,,,,,,,,,,,,,,,,,,,,,,,,,,,,,,,,,,,,,,,,,,,,,,,,,,,,,,,,,,,,,,,,342,5H,67,"Box # 172",,"Library Records",,,,,,,,,,,,,,,,,,,,,,,,,,,,,,,,,,,,,,,,,,,,,,,,,,,,,,,,,,,,,,,,,,,,,,,,,,,,,,,,,,,,,,,,,,,,,,,,"1957,letter,library",,Archival,,1,0
12038,https://archive.carpentershall.org/items/show/12038,"Letter from R. Thomas Unkefer suggesting a meeting of the Library Committee and possible projects",,,,,1998-06-08,,"Library Committee Business & Correspondence",,,,,,,,,,"E. Fred Brecher",,,,,,,,,,,,,,,,,,,,,,,,,,,,,,,,,,,,,,,,,,,,,,,,,,,,,,,,,,,,,,,,,,,,,,,,688,5F,48,"Box # 173",,"Library Records",,,,,,,,,,,,,,,,,,,,,,,,,,,,,,,,,,,,,,,,,,,,,,,,,,,,,,,,,,,,,,,,,,,,,,,,,,,,,,,,,,,,,,,,,,,,,,,,"1998,letter,library,library committee",,Archival,,1,0
12051,https://archive.carpentershall.org/items/show/12051,"Letter from Putinas V. Masalaitis announcing the completion of the member video project as well as thanking those who participated",,,,,1997-02-06,,"Library Committee Business & Correspondence",,,,,,,,,,"E. Fred Brecher",,,,,,,,,,,,,,,,,,,,,,,,,,,,,,,,,,,,,,,,,,,,,,,,,,,,,,,,,,,,,,,,,,,,,,,,701,5F,51,"Box # 173",,"Library Records",,,,,,,,,,,,,,,,,,,,,,,,,,,,,,,,,,,,,,,,,,,,,,,,,,,,,,,,,,,,,,,,,,,,,,,,,,,,,,,,,,,,,,,,,,,,,,,,"1997,letter,library,library committee,video",,Archival,,1,0
11632,https://archive.carpentershall.org/items/show/11632,"Letter from Norman N. Rice regarding the CCCCP/A.I.A. book",,,,,1961-07-14,,"20th Century Publications",,,,,,,,,,"H. Mather Lippincott",,,,,,,,,,,,,,,,,,,,,,,,,,,,,,,,,,,,,,,,,,,,,,,,,,,,,,,,,,,,,,,,,,,,,,,,282,5H,17,"Box # 172",,"Library Records",,,,,,,,,,,,,,,,,,,,,,,,,,,,,,,,,,,,,,,,,,,,,,,,,,,,,,,,,,,,,,,,,,,,,,,,,,,,,,,,,,,,,,,,,,,,,,,,"1961,letter,library",,Archival,,1,0
11654,https://archive.carpentershall.org/items/show/11654,"Letter from Mather Lippincott to the mayor, Richardson Dilworth, regarding a possible ceremony due to the publication of the CCCCP/A.I.A. book",,,,,1957-12-30,,"20th Century Publications",,,,,,,,,,"H. Mather Lippincott",,,,,,,,,,,,,,,,,,,,,,,,,,,,,,,,,,,,,,,,,,,,,,,,,,,,,,,,,,,,,,,,,,,,,,,,304,5H,39,"Box # 172",,"Library Records",,,,,,,,,,,,,,,,,,,,,,,,,,,,,,,,,,,,,,,,,,,,,,,,,,,,,,,,,,,,,,,,,,,,,,,,,,,,,,,,,,,,,,,,,,,,,,,,"1957,h. mather lippincott,letter,library",,Archival,,1,0
11630,https://archive.carpentershall.org/items/show/11630,"Letter from Mather Lippincott to Norman Rice concerning the CCCCP/A.I.A.",,,,,1961-11-14,,"20th Century Publications",,,,,,,,,,"H. Mather Lippincott",,,,,,,,,,,,,,,,,,,,,,,,,,,,,,,,,,,,,,,,,,,,,,,,,,,,,,,,,,,,,,,,,,,,,,,,280,5H,15,"Box # 172",,"Library Records",,,,,,,,,,,,,,,,,,,,,,,,,,,,,,,,,,,,,,,,,,,,,,,,,,,,,,,,,,,,,,,,,,,,,,,,,,,,,,,,,,,,,,,,,,,,,,,,"1961,h. mather lippicott,letter,library",,Archival,,1,0
11658,https://archive.carpentershall.org/items/show/11658,"Letter from Mather Lippincott to Alan B. Kirschbaum regarding payment of bills for the CCCCP/A.I.A. book and concluding the involvement of Edward Stern and Company",,,,,1958-01-14,,"20th Century Publications",,,,,,,,,,"H. Mather Lippincott",,,,,,,,,,,,,,,,,,,,,,,,,,,,,,,,,,,,,,,,,,,,,,,,,,,,,,,,,,,,,,,,,,,,,,,,308,5H,43,"Box # 172",,"Library Records",,,,,,,,,,,,,,,,,,,,,,,,,,,,,,,,,,,,,,,,,,,,,,,,,,,,,,,,,,,,,,,,,,,,,,,,,,,,,,,,,,,,,,,,,,,,,,,,"1958,h. mather lippinccott,letter,library",,Archival,,1,0
11627,https://archive.carpentershall.org/items/show/11627,"Letter from Mather Lippincott regarding the CCCCP/A.I.A. book",,,,,1962-01-26,,"20th Century Publications",,,,,,,,,,"H. Mather Lippincott",,,,,,,,,,,,,,,,,,,,,,,,,,,,,,,,,,,,,,,,,,,,,,,,,,,,,,,,,,,,,,,,,,,,,,,,277,5H,12,"Box # 172",,"Library Records",,,,,,,,,,,,,,,,,,,,,,,,,,,,,,,,,,,,,,,,,,,,,,,,,,,,,,,,,,,,,,,,,,,,,,,,,,,,,,,,,,,,,,,,,,,,,,,,"1962,h. mather lippincott,letter,library",,Archival,,1,0